{"text_format":"1","workbook":"xlsx","n_sheets":25,"sheets":["Instructions","Formula Sheet","Point Grid","Navigator","1","2","3","4","5","6","7","8","9","10","11","12","13","14","15","16","17","18","19","20","21"],"not_rendered":{"charts":1,"images":5,"macros":1,"external_links":0,"defined_names":0,"comments":0,"pivot_tables":0},"unopened":[],"bounds":{"document_bytes":16777216,"sheet_cells":100000,"rows_first":2000,"rows_last":500,"rows_between":2000,"halvings":0,"cell_chars":16384,"cell_head_chars":4096},"cells_cut":0,"cells_raw":0,"read":"whole","date_system":"1900"}

{"sheet":"Instructions","index":0,"n_rows":32,"n_cols":1,"rows_kept":32,"cut":false,"hidden":false,"merged":[]}
[]
[]
[]
[]
[]
["Instructions"]
{"$rows_left_out":27}
{"sheet":"Formula Sheet","index":1,"n_rows":27,"n_cols":2,"rows_kept":27,"cut":false,"hidden":true,"merged":[]}
[]
[]
[]
[]
[]
["FORMULA SHEET"]
{"$rows_left_out":22}
{"sheet":"Point Grid","index":2,"n_rows":32,"n_cols":19,"rows_kept":32,"cut":false,"hidden":false,"merged":[[5,1,6,1]]}
[]
[]
[]
[]
["2016 Exam 8"]
[null,"Total Point Value","Sub-Part of Question",null,null,null,null,null,null,null,null,"Your Score","Sub-Part of Question"]
{"$rows_left_out":27}
{"sheet":"Navigator","index":3,"n_rows":29,"n_cols":8,"rows_kept":29,"cut":false,"hidden":false,"merged":[[26,0,26,6],[27,0,27,6],[28,0,28,6],[20,0,20,6],[21,0,21,6],[22,0,22,6],[23,0,23,6],[24,0,24,6],[25,0,25,6],[19,0,19,6],[8,0,8,6],[9,0,9,6],[10,0,10,6],[11,0,11,6],[12,0,12,6],[13,0,13,6],[14,0,14,6],[15,0,15,6],[16,0,16,6],[17,0,17,6],[18,0,18,6]]}
[]
[]
[]
[]
[]
["Navigator – Select a question to go to it"]
{"$rows_left_out":24}
{"sheet":"1","index":4,"n_rows":35,"n_cols":14,"rows_kept":35,"cut":false,"hidden":false,"merged":[[5,1,6,1],[0,6,0,7]]}
[1,"Finished",null,null,null,null,"Navigator",null,null,"Solution"]
[null,null,null,null,null,null,null,null,"(a)","From the Bailey and Simon paper we know there is limited variation in the"]
["Points","A group of insureds have different expected claim frequencies. The number of insureds claim-free",null,null,null,null,null,null,null,"group of insured's chance of an accident if the credibility is proportional to"]
[{"$f":"INDEX('Point Grid'!B:B,MATCH('1'!A1,'Point Grid'!A:A,0))","v":2.75},"for the past t years is as follows:",null,null,null,null,null,null,null,"the number of years of experience."]
[]
[null,"Expected Claim Frequency",null,null,null,null,null,null,null,"Expected Claims"]
{"$rows_left_out":30}
{"sheet":"2","index":5,"n_rows":17,"n_cols":11,"rows_kept":17,"cut":false,"hidden":false,"merged":[[0,7,0,8]]}
[2,"Finished",null,null,null,null,null,"Navigator",null,null,"Solution"]
[null,null,null,null,null,null,null,null,null,"(a)","To group classes of insureds with similar risk characteristics and/or expected costs"]
["Points",null,null,null,null,null,null,null,null,null,"into larger homogeneous groups that have sufficient volume for credible ratemaking."]
[{"$f":"INDEX('Point Grid'!B:B,MATCH('2'!A1,'Point Grid'!A:A,0))","v":2},null,null,null,null,null,null,null,null,null,"The clustering should maximize the variance between classes and minimize the "]
["(a)","Describe the purpose of clustering as it pertains to risk classification.",null,null,null,null,null,null,null,null,"variance within classes."]
[{"$f":"INDEX('Point Grid'!$C$8:$I$30,MATCH($A$1,'Point Grid'!$A$8:$A$30,0),MATCH(A5,'Point Grid'!$C$7:$I$7,0))","v":0.5}]
{"$rows_left_out":12}
{"sheet":"3","index":6,"n_rows":19,"n_cols":8,"rows_kept":19,"cut":false,"hidden":false,"merged":[]}
[3,"Finished",null,null,null,"Navigator",null,"Solution"]
[null,null,null,null,null,null,"(a)","Credibility: Since there are only two channels and an insured must come through one of "]
["Points","A private passenger automobile insurer sells policies through two distribution channels:",null,null,null,null,null,"them, it is likely that both channels are large enough to produce credible predictions."]
[{"$f":"INDEX('Point Grid'!B:B,MATCH('3'!A1,'Point Grid'!A:A,0))","v":2},"independent insurance agents and directly to consumers via the internet.",null,null,null,null,null,"Absence of Ambiguity: Each channel is clearly defined and easy to determine which route"]
[null,null,null,null,null,null,null,"an insured came from. Further, the channels are mutually independent."]
[null,"The company's rates already incorporate expense differentials between the two channels but"]
{"$rows_left_out":14}
{"sheet":"4","index":7,"n_rows":21,"n_cols":9,"rows_kept":21,"cut":false,"hidden":false,"merged":[]}
[4,"Finished",null,null,null,null,"Navigator",null,"Solution"]
[null,null,null,null,null,null,null,"(a)","   i. Including the limit of liability in a GLM can lead to unexpected results such as a "]
["Points","An actuary is conducting a generalized linear model (GLM) analysis on historical personal ",null,null,null,null,null,null,"       lower rate for more coverage. This can be because of favourable selection."]
[{"$f":"INDEX('Point Grid'!B:B,MATCH('4'!A1,'Point Grid'!A:A,0))","v":3},"automobile data in order to develop a rating plan.",null,null,null,null,null,null,"  ii. The number of coverage changes during the current policy period will not be available"]
[null,null,null,null,null,null,null,null,"       at inception. Further, the number is likely to be different from year to year which"]
["(a)","Argue against the following factors being included as predictors in the actuary's GLM analysis:",null,null,null,null,null,null,"       will dilute its usefulness as a predictor."]
{"$rows_left_out":16}
{"sheet":"5","index":8,"n_rows":31,"n_cols":13,"rows_kept":31,"cut":false,"hidden":false,"merged":[]}
[5,"Finished",null,null,null,"Navigator",null,"Solution"]
[null,null,null,null,null,null,"(a)","Rank the risks by model predicted loss in increasing order."]
["Points","A GLM has been used to develop an insurance rating plan. The results are given below:",null,null,null,null,null,null,null,null,"Cumulative",null,"Cumulative"]
[{"$f":"INDEX('Point Grid'!B:B,MATCH('5'!A1,'Point Grid'!A:A,0))","v":2.25},null,null,null,null,null,null,"Rank","Risk","Model","% Exposure","Actual","% Actual Loss"]
[null,"Risk","Model Predicted Loss","Actual Loss",null,null,null,0,0,0,0,0,0]
[null,1,2000,2050,null,null,null,1,5,{"$f":"INDEX($C$6:$C$10,MATCH(I6,$B$6:$B$10,0))","v":200},{"$f":"COUNT(I6:$I$6)/COUNT($I$6:$I$10)","v":0.2},{"$f":"INDEX($D$6:$D$10,MATCH(I6,$B$6:$B$10,0))","v":400},{"$f":"SUM(L6:$L$6)/$L$11","v":0.08}]
{"$rows_left_out":26}
{"sheet":"6","index":9,"n_rows":26,"n_cols":12,"rows_kept":26,"cut":false,"hidden":false,"merged":[]}
[6,"Finished",null,null,null,null,"Navigator",null,"Solution"]
[null,null,null,null,null,null,null,"(a)","ln(μ) = 0.91 + 0.013*4 + -0.187*ln(25000) + 0.062*8"]
["Points","An actuary has constructed a three-variable Tweedie GLM with a log-link function to estimate loss ",null,null,null,null,null,null,"ln(μ) = ",{"$f":" 0.91 + 0.013*4 + -0.187*LN(25000) + 0.062*8","v":-0.43568001642001308}]
[{"$f":"INDEX('Point Grid'!B:B,MATCH('6'!A1,'Point Grid'!A:A,0))","v":2.5},"ratios for commercial property new business. The actuary wants to create a second model for renewal",null,null,null,null,null,null,"The modelled loss ratio, μ, is",null,null,{"$f":"EXP(J3)","v":0.64682466609722866}]
[null,"business that will include all of the variables from the new business model, plus a variable for the prior"]
[null,"year claim count. The actuary requires that the coefficients of the variables (Average Building Age,",null,null,null,null,null,"(b)","The renewal model may be written as"]
{"$rows_left_out":21}
{"sheet":"7","index":10,"n_rows":22,"n_cols":14,"rows_kept":22,"cut":false,"hidden":false,"merged":[[0,6,0,7]]}
[7,"Finished",null,null,null,null,"Navigator",null,null,"Solution"]
[null,null,null,null,null,null,null,null,"(a)","AIC = -2*log-likelihood + 2*(# parameters)"]
["Points","A company is considering modifying its rating plan to include factors by age",null,null,null,null,null,null,null,"BIC = -2*log-likelihood + p*ln(n)"]
[{"$f":"INDEX('Point Grid'!B:B,MATCH('7'!A1,'Point Grid'!A:A,0))","v":1.5},"group. Below are statistics for the base model and for the new model."]
[null,null,null,null,null,null,null,null,null,"Base model"]
[null,"Statistic","Base Model","New Model",null,null,null,null,null,"AIC = -2*(-750) + 2*10 =",null,null,{"$f":"-2*C7+2*C9","v":1520}]
{"$rows_left_out":17}
{"sheet":"8","index":11,"n_rows":22,"n_cols":16,"rows_kept":22,"cut":false,"hidden":false,"merged":[]}
[8,"Finished",null,null,null,null,"Navigator",null,"Solution"]
[null,null,null,null,null,null,null,"(a)","To determine whether anti-selection is present we can compare the ILFs for the individual policy"]
["Points","Given the following average severity, an actuary wants to validate if anti-selection ",null,null,null,null,null,null,"limits with those obtained using all available policy limits."]
[{"$f":"INDEX('Point Grid'!B:B,MATCH('8'!A1,'Point Grid'!A:A,0))","v":2.75},"impacts its Increased Limits Factors for a given insurance coverage:"]
[null,null,null,"Policy Limit",null,null,null,null,"All Policy Limits ILFs",null,null,"$25k Policy Limit ILFs",null,null,"$50k Policy Limit ILFs"]
[null,null,"Severity limited to:",25000,50000,null,null,null,10000,{"$f":"SUM(D7:E7)/SUM($D$7:$E$7)","v":1},null,10000,{"$f":"D7/$D$7","v":1},null,10000,{"$f":"E7/$E$7","v":1}]
{"$rows_left_out":17}
{"sheet":"9","index":12,"n_rows":21,"n_cols":11,"rows_kept":21,"cut":false,"hidden":false,"merged":[]}
[9,"Finished",null,null,null,null,null,null,"Navigator",null,"Solution"]
[null,null,null,null,null,null,null,null,null,"(a)","The underwriter should consider whether the risk is a good fit for the class it is in as an"]
["Points","An actuary and an underwriter are discussing a Workers' Compensation book of business.",null,null,null,null,null,null,null,null,"increased experience modifier doesn't necessarily imply a bad risk. Since the predominant"]
[{"$f":"INDEX('Point Grid'!B:B,MATCH('9'!A1,'Point Grid'!A:A,0))","v":1.5},null,null,null,null,null,null,null,null,null,"risk in the class has had a decreasing modifier, the risk under consideration could receive an"]
[null,null,null,null,null,null,null,null,null,null,"increased experience modifier due to random fluctuations if it is not a good fit for the class."]
["(a)","The underwriter is considering not renewing a risk in the book because the experience",null,null,null,null,null,null,null,null,"The underwriter should check the standard loss ratios for the risks in the classes to see if"]
{"$rows_left_out":16}
{"sheet":"10","index":13,"n_rows":32,"n_cols":16,"rows_kept":32,"cut":false,"hidden":false,"merged":[[27,5,28,5]]}
[10,"Finished",null,null,null,null,null,"Navigator",null,"Solution"]
[null,null,null,null,null,null,null,null,"(a)","Look up the class code in the tables provided to get the ELR and D-ratio."]
["Points","An insured is subject to experience rating under the National Council on Compensation",null,null,null,null,null,null,null,"ELR =",{"$f":"C25","v":2.02}]
[{"$f":"INDEX('Point Grid'!B:B,MATCH('10'!A1,'Point Grid'!A:A,0))","v":2.5},"Insurance (NCCI)'s Experience Rating Plan Manual for Workers' Compensation and",null,null,null,null,null,null,null,"D-Ratio =",{"$f":"D25","v":0.17}]
[null,"Employers Liability Insurance. The following information about the insured is given:"]
[null,null,null,null,null,null,null,null,null,"Expected Unlimited Loss = (Payroll/$100)*ELR =",null,null,null,null,{"$f":"B7/100*K3","v":101000}]
{"$rows_left_out":27}
{"sheet":"11","index":14,"n_rows":50,"n_cols":14,"rows_kept":50,"cut":false,"hidden":false,"merged":[[4,1,5,1],[4,4,5,4],[0,6,0,7],[4,6,5,6],[4,5,5,5],[4,3,5,3],[4,2,5,2]]}
[11,"Finished",null,null,null,null,"Navigator",null,null,"Solution"]
[null,null,null,null,null,null,null,null,"(a)","Perform a Quintiles Test. Sort the risks by order of increasing modification"]
["Points","Given the following information about 10 risks for a manufacturing class:",null,null,null,null,null,null,null,null,null,null,"Premiums"]
[{"$f":"INDEX('Point Grid'!B:B,MATCH('11'!A1,'Point Grid'!A:A,0))","v":3.75},null,null,null,null,null,null,null,null,"Risk","Current Rank","Proposed Rank","Current Mod","Proposed Mod"]
[null,"Risk","Type of Manufacturing","Manual Premium","Losses","Current Modification","Proposed Modification",null,null,1,{"$f":"_xlfn.RANK.AVG(F7,$F$7:$F$16,1)","v":1},{"$f":"_xlfn.RANK.AVG(G7,$G$7:$G$16,1)","v":1},{"$f":"F7*D7","v":650},{"$f":"G7*D7","v":500}]
[null,null,null,null,null,null,null,null,null,2,{"$f":"_xlfn.RANK.AVG(F8,$F$7:$F$16,1)","v":3},{"$f":"_xlfn.RANK.AVG(G8,$G$7:$G$16,1)","v":2},{"$f":"F8*D8","v":750},{"$f":"G8*D8","v":550}]
{"$rows_left_out":45}
{"sheet":"12","index":15,"n_rows":48,"n_cols":14,"rows_kept":48,"cut":false,"hidden":false,"merged":[]}
[12,"Finished",null,null,null,null,"Navigator",null,"Solution"]
[null,null,null,null,null,null,null,"(a)","Since we're not given the expected loss we will use the average actual loss because"]
["Points","An actuary is given the following sample of experience from a grouping of five similarly-sized risks:",null,null,null,null,null,null,"the risks are similar sized."]
[{"$f":"INDEX('Point Grid'!B:B,MATCH('12'!A1,'Point Grid'!A:A,0))","v":2.5}]
[null,null,"Risk","Actual Loss",null,null,null,null,"Expected Loss =",null,{"$f":"AVERAGE(D6:D10)","v":85000}]
[null,null,1,85000]
{"$rows_left_out":43}
{"sheet":"13","index":16,"n_rows":34,"n_cols":10,"rows_kept":34,"cut":false,"hidden":false,"merged":[]}
[13,"Finished",null,null,null,"Navigator",null,"Solution"]
[null,null,null,null,null,null,"(a)","The converted insurance charge is cI = c(φ(rmax) - ψ(rmin))"]
["Points","A risk is written using a retrospective rating plan with the following characteristics:",null,null,null,null,null,"c = ",{"$f":"B8","v":1.085}]
[{"$f":"INDEX('Point Grid'!B:B,MATCH('13'!A1,'Point Grid'!A:A,0))","v":2.5},10000000,"Standard Premium",null,null,null,null,"Expected loss =",null,{"$f":"B4*B5","v":6000000}]
[null,0.6,"Expected Loss Ratio"]
[null,0.8,"Loss Ratio at Maximum Premium",null,null,null,null,"Notice the graph is given in terms of loss ratio rather than entry ratios. So φ(rmax) corresponds"]
{"$rows_left_out":29}
{"sheet":"14","index":17,"n_rows":34,"n_cols":9,"rows_kept":34,"cut":false,"hidden":false,"merged":[]}
[14,"Finished",null,null,null,null,"Navigator",null,"Solution"]
[null,null,null,null,null,null,null,"(a)","Draw a Lee Diagram that shows the unlimited and limited loss curves as well as the"]
["Points","A retrospective rated policy has both a loss limitation and a maximum premium.",null,null,null,null,null,null,"entry ratio at maximum premium."]
[{"$f":"INDEX('Point Grid'!B:B,MATCH('14'!A1,'Point Grid'!A:A,0))","v":1.75}]
[]
["(a)","Demonstrate how the charges for the loss limitation and the maximum premium overlap."]
{"$rows_left_out":29}
{"sheet":"15","index":18,"n_rows":38,"n_cols":15,"rows_kept":38,"cut":false,"hidden":false,"merged":[[0,7,0,8]]}
[15,"Finished",null,null,null,null,null,"Navigator",null,null,"Solution"]
[null,null,null,null,null,null,null,null,null,"(a)","The premium for an excess Workers' Compensation policy is given by"]
["Points","Given the following information about a Workers' Compensation book of business:"]
[{"$f":"INDEX('Point Grid'!B:B,MATCH('15'!A1,'Point Grid'!A:A,0))","v":1.75}]
[]
[null,null,null,null,null,null,null,null,null,null,"Recall this type of policy only handles and pays out on claims above the deductible."]
{"$rows_left_out":33}
{"sheet":"16","index":19,"n_rows":41,"n_cols":15,"rows_kept":41,"cut":false,"hidden":false,"merged":[[0,5,0,6]]}
[16,"Finished",null,null,null,"Navigator",null,null,"Solution"]
[null,null,null,null,null,null,null,"(a)","Expiring Structure"]
["Points","An actuary is given the following expiring policy information for a Workers' Compensation"]
[{"$f":"INDEX('Point Grid'!B:B,MATCH('16'!A1,'Point Grid'!A:A,0))","v":3.75},"Large Dollar Deductible policy:"]
[null,500000,"Expected Total Loss & ALAE"]
[null,100000,"Deductible",null,null,null,null,null,"Where LBA is the loss based assessment factor."]
{"$rows_left_out":36}
{"sheet":"17","index":20,"n_rows":37,"n_cols":13,"rows_kept":37,"cut":false,"hidden":false,"merged":[[0,7,0,8],[16,7,17,7],[16,3,17,3],[16,2,17,2],[16,4,17,4],[16,5,17,5],[16,6,17,6]]}
[17,"Finished",null,null,null,null,null,"Navigator",null,null,"Solution"]
[null,null,null,null,null,null,null,null,null,"(a)","E[PT] =",{"$f":"(G21+D21)/(H21+E21)","v":1.125E-2}]
["Points","The original 2016 Q17 is no longer on the Exam 8 Syllabus. It has been replaced with 2015 Q5 which has",null,null,null,null,null,null,null,null,"E[F] =",{"$f":"(C21+F21)/(E21+H21)","v":2E-3}]
[{"$f":"INDEX('Point Grid'!B:B,MATCH('17'!A1,'Point Grid'!A:A,0))","v":2.5},"the same point value."]
[null,null,null,null,null,null,null,null,null,null,"E[Class 2 PT] = E[PT] + wF*(F2 - E[F]) + wPT*(PT2 - E[PT])"]
[null,"An actuary estimated the loss cost for Workers' Compensation insurance using a ",null,null,null,null,null,null,null,null,"Here F means Fatal claims, PT means Permanent Total claims, and a subscript 2"]
{"$rows_left_out":32}
{"sheet":"18","index":21,"n_rows":14,"n_cols":13,"rows_kept":14,"cut":false,"hidden":false,"merged":[[0,8,0,10]]}
[18,"Finished",null,null,null,null,null,null,"Navigator",null,null,null,"Solution"]
[null,null,null,null,null,null,null,null,null,null,null,"(a)","Hazard Module:"]
["Points","Catastrophe models were built to assist the insurance industry in quantifying the risk of",null,null,null,null,null,null,null,null,null,null,"Epistemic risk is uncertainty due to limited scientific knowledge about the occurrence and strength"]
[{"$f":"INDEX('Point Grid'!B:B,MATCH('18'!A1,'Point Grid'!A:A,0))","v":2},"natural disasters.",null,null,null,null,null,null,null,null,null,null,"of earthquakes."]
[null,null,null,null,null,null,null,null,null,null,null,null,"Inventory Module:"]
["(a)","For any two of the four basic modules of a catastrophe model, provide an example of ",null,null,null,null,null,null,null,null,null,null,"Epistemic risk is uncertainty due to insufficient knowledge of individual building construction and"]
{"$rows_left_out":9}
{"sheet":"19","index":22,"n_rows":43,"n_cols":16,"rows_kept":43,"cut":false,"hidden":false,"merged":[[0,6,0,7]]}
[19,"Finished",null,null,null,null,"Navigator",null,null,"Solution"]
[null,null,null,null,null,null,null,null,"(a)","Option 1"]
["Points","In order for an insurance company to increase its return on capital, two reinsurance ",null,null,null,null,null,null,null,"Ceded Loss",null,null,"Ceded ALAE = (Ceded Loss / Total Loss )*(Total ALAE)"]
[{"$f":"INDEX('Point Grid'!B:B,MATCH('19'!A1,'Point Grid'!A:A,0))","v":3},"options are being considered:",null,null,null,null,null,null,null,"Claim 1",{"$f":"MIN(F18-5*10^6,5*10^6)","v":2500000},null,"Claim 1",{"$f":"K4/F18*G18","v":500000}]
[null,"   i. $5 million excess of $5 million per risk:",null,null,null,null,null,null,null,"Claim 2",{"$f":"MIN(F19-5*10^6,5*10^6)","v":5000000},null,"Claim 2",{"$f":"K5/F19*G19","v":250000}]
[null,"       • ALAE pro-rata",null,null,null,null,null,null,null,"Total",{"$f":"SUM(K4:K5)","v":7500000},null,"Total",{"$f":"SUM(N4:N5)","v":750000}]
{"$rows_left_out":38}
{"sheet":"20","index":23,"n_rows":35,"n_cols":14,"rows_kept":35,"cut":false,"hidden":false,"merged":[[0,5,0,6]]}
[20,"Finished",null,null,null,"Navigator",null,null,"Solution"]
[null,null,null,null,null,null,null,"(a)",null,"A","B","C","Primary"]
["Points","A primary insurer has entered into property catastrophe excess of loss treaties with three ",null,null,null,null,null,null,"Loss","100 xs 200","100 xs 300","100 xs 400","Insurer","Total"]
[{"$f":"INDEX('Point Grid'!B:B,MATCH('20'!A1,'Point Grid'!A:A,0))","v":3},"reinsurers. The terms of the treaties are as follows:",null,null,null,null,null,null,1,{"$f":"MAX(0,MIN(100,D13-200))*100%","v":100},{"$f":"MAX(0,MIN(100,D13-300))*100%","v":80},{"$f":"MAX(0,MIN(100,D13-400))*100%","v":0},{"$f":"D13-SUM(J4:L4)","v":200},{"$f":"SUM(J4:M4)","v":380}]
[null,null,null,null,null,null,null,null,2,{"$f":"MAX(0,MIN(100,D14-200))*100%","v":60},{"$f":"MAX(0,MIN(100,D14-300))*100%","v":0},{"$f":"MAX(0,MIN(100,D14-400))*100%","v":0},{"$f":"D14-SUM(J5:L5)","v":200},{"$f":"SUM(J5:M5)","v":260}]
[null,"Reinsurer A:    100% of $100 excess of $200 written at a nominal rate on line of 10%.",null,null,null,null,null,null,3,{"$f":"MAX(0,MIN(100-J5,D15-200))*100%","v":40},{"$f":"MAX(0,MIN(100-K5,D15-300))*100%","v":100},{"$f":"MAX(0,MIN(100-L5,D15-400))*100%","v":100},360,600]
{"$rows_left_out":30}
{"sheet":"21","index":24,"n_rows":34,"n_cols":13,"rows_kept":34,"cut":false,"hidden":false,"merged":[[0,4,0,5],[7,3,8,3],[7,2,8,2],[7,4,8,4],[14,2,15,2],[14,3,15,3],[14,4,15,4]]}
[21,"Finished",null,null,"Navigator",null,null,"Solution"]
[null,null,null,null,null,null,"(a)","Insured Value Range",null,null,"Average in Range"]
["Points","An insurance company insures high value homes and plans to increase the maximum ",null,null,null,null,null,"1m to 4m",null,null,{"$f":"AVERAGE(1*10^6,4*10^6)","v":2500000}]
[{"$f":"INDEX('Point Grid'!B:B,MATCH('21'!A1,'Point Grid'!A:A,0))","v":4},"property value they will insure next year. The company is considering purchasing a new"]
[null,"$4,000,000 excess of $4,000,000 reinsurance treaty. The reinsurer is given the following",null,null,null,null,null,"Percent of Cumulative Loss under $1 million"]
[null,"limit profile:",null,null,null,null,null,"E[X; 1million] / E[X] =",null,null,{"$f":"(E17+D18*1000000)/E19","v":0.8}]
{"$rows_left_out":28}