{"text_format":"1","workbook":"xlsx","n_sheets":24,"sheets":["Instructions","Formula Sheet","Point Grid","Navigator","1","2","3","4","5","6","7","8","9","10","11","12","13","14","15","16","17","18","19","20"],"not_rendered":{"charts":6,"images":6,"macros":1,"external_links":0,"defined_names":0,"comments":0,"pivot_tables":0},"unopened":[],"bounds":{"document_bytes":16777216,"sheet_cells":100000,"rows_first":2000,"rows_last":500,"rows_between":2000,"halvings":0,"cell_chars":16384,"cell_head_chars":4096},"cells_cut":0,"cells_raw":0,"read":"whole","date_system":"1900"}

{"sheet":"Instructions","index":0,"n_rows":32,"n_cols":1,"rows_kept":32,"cut":false,"hidden":false,"merged":[]}
[]
[]
[]
[]
[]
["Instructions"]
{"$rows_left_out":27}
{"sheet":"Formula Sheet","index":1,"n_rows":27,"n_cols":2,"rows_kept":27,"cut":false,"hidden":true,"merged":[]}
[]
[]
[]
[]
[]
["FORMULA SHEET"]
{"$rows_left_out":22}
{"sheet":"Point Grid","index":2,"n_rows":31,"n_cols":19,"rows_kept":31,"cut":false,"hidden":false,"merged":[[5,1,6,1]]}
[]
[]
[]
[]
["2017 Exam 8"]
[null,"Total Point Value","Sub-Part of Question",null,null,null,null,null,null,null,null,"Your Score","Sub-Part of Question"]
{"$rows_left_out":26}
{"sheet":"Navigator","index":3,"n_rows":28,"n_cols":8,"rows_kept":28,"cut":false,"hidden":false,"merged":[[19,0,19,6],[8,0,8,6],[9,0,9,6],[10,0,10,6],[11,0,11,6],[12,0,12,6],[13,0,13,6],[14,0,14,6],[15,0,15,6],[16,0,16,6],[17,0,17,6],[18,0,18,6],[26,0,26,6],[27,0,27,6],[20,0,20,6],[21,0,21,6],[22,0,22,6],[23,0,23,6],[24,0,24,6],[25,0,25,6]]}
[]
[]
[]
[]
[]
["Navigator – Select a question to go to it"]
{"$rows_left_out":23}
{"sheet":"1","index":4,"n_rows":82,"n_cols":17,"rows_kept":82,"cut":false,"hidden":false,"merged":[[0,7,0,8]]}
[1,"Finished",null,null,null,null,null,"Navigator",null,null,"Solution"]
[null,null,null,null,null,null,null,null,null,"(a)","Industry:","This has a low p-value which implies the variable is statistically significant, i.e. a good predictor of future loss."]
["Points","An actuary has constructed a pure premium model using the Tweedie distribution with parameter",null,null,null,null,null,null,null,null,null,"Industry is a variable that is easy and practical to collect and verify."]
[{"$f":"INDEX('Point Grid'!B:B,MATCH('1'!A1,'Point Grid'!A:A,0))","v":8.5},"1 < p < 2 to determine manual rates for a Workers' Compensation book of business. The output of the model "]
[null,"is pure premium per $100 of payroll.",null,null,null,null,null,null,null,null,"Employee Tenure:",null,"The low p-value implies it is significant and a good predictor of future loss."]
[null,null,null,null,null,null,null,null,null,null,null,null,"Employee tenure is directly related to future loss activity as newer employees"]
{"$rows_left_out":77}
{"sheet":"2","index":5,"n_rows":25,"n_cols":14,"rows_kept":25,"cut":false,"hidden":false,"merged":[[6,1,8,1],[0,7,0,8],[6,2,8,2],[6,3,8,3],[6,4,8,4],[6,5,8,5]]}
[2,"Finished",null,null,null,null,null,"Navigator",null,null,"Solution"]
[null,null,null,null,null,null,null,null,null,"(a)","Since we have two limits, the centroid of each cluster has two coordinates. The first"]
["Points","An actuary wants to cluster five Workers' Compensation classes based on excess ratios at",null,null,null,null,null,null,null,null,"corresponds to the weighted average excess ratio for the 500,000 limit for classes in the cluster,"]
[{"$f":"INDEX('Point Grid'!B:B,MATCH('2'!A1,'Point Grid'!A:A,0))","v":2},"two limits: 500,000 and 1,000,000. The actuary decides to use a weighted k-means",null,null,null,null,null,null,null,null,"while the second corresponds to the weighted average excess ratio for the 1,000,000 limit."]
[null,"algorithm with two clusters. Given the following:"]
[null,null,null,null,null,null,null,null,null,null,"Centroids","Limit"]
{"$rows_left_out":20}
{"sheet":"3","index":6,"n_rows":35,"n_cols":12,"rows_kept":35,"cut":false,"hidden":false,"merged":[[5,1,6,1],[5,2,6,2],[5,3,6,3],[5,4,6,4]]}
[3,"Finished",null,null,null,"Navigator",null,"Solution"]
[null,null,null,null,null,null,"(a)","Using earned premium as the exposure base will only correct for maldistribution due to correlation"]
["Points","The following data shows the experience of a merit rating plan for private passenger ",null,null,null,null,null,"between frequency and territory when:"]
[{"$f":"INDEX('Point Grid'!B:B,MATCH('3'!A1,'Point Grid'!A:A,0))","v":1.5},"vehicles. The merit rating plan uses multiple rating variables, including territory.",null,null,null,null,null,"1. Territory differentials are proper, i.e. all territories have the same loss ratio, and"]
[null,null,null,null,null,null,null,"2. High frequency territories are also high premium territories."]
[null,"Number of Accident-Free Years","Earned Car Years (000s)","Earned Premium ($000s)","Number of Incurred Claims"]
{"$rows_left_out":30}
{"sheet":"4","index":7,"n_rows":36,"n_cols":9,"rows_kept":36,"cut":false,"hidden":false,"merged":[]}
[4,"Finished",null,null,null,null,"Navigator",null,"Solution"]
[null,null,null,null,null,null,null,"(a)","• To prevent overfitting. As more parameters are added to the model, the fit on the training"]
["Points","An actuary has split data into training and test groups for a model. The chart below shows",null,null,null,null,null,null,"data set always improves. The test data set may not improve, indicating the model is being"]
[{"$f":"INDEX('Point Grid'!B:B,MATCH('4'!A1,'Point Grid'!A:A,0))","v":1.75},"the relationship between model performance and model complexity. Model performance",null,null,null,null,null,null,"fit to noise in the training data set instead."]
[null,"is represented by model error and model complexity is represented by degrees of freedom.",null,null,null,null,null,null,"• To measure the predictive power of the model. If we try to assess the model on the training"]
[null,null,null,null,null,null,null,null,"data set it will be too optimistic of its performance."]
{"$rows_left_out":31}
{"sheet":"5","index":8,"n_rows":47,"n_cols":11,"rows_kept":47,"cut":false,"hidden":false,"merged":[]}
[5,"Finished",null,null,null,null,"Navigator",null,"Solution"]
[null,null,null,null,null,null,null,"(a)","A saturated model perfectly predicts every result."]
["Points","An analyst has fit several different variations of a logistic GLM to a data set containing 1,000",null,null,null,null,null,"(i.)","We have 10,000 claim records which are perfectly predicted."]
[{"$f":"INDEX('Point Grid'!B:B,MATCH('5'!A1,'Point Grid'!A:A,0))","v":1.75},"records of fraudulent claims and 9,000 records of legitimate claims. For each model variation",null,null,null,null,null,null,"Ordering the claim records by prediction (0 = no fraud, 1 = fraud) from smallest to largest "]
[null,"listed below, draw a quintile plot based on the training data. Label the axes and identify each",null,null,null,null,null,null,"and dividing into 5 quintiles, we see that each quintile has 2,000 claims in it. "]
[null,"data series.",null,null,null,null,null,null,"So the first 4 quintiles consist of all 0 predictions and 0 fraud."]
{"$rows_left_out":42}
{"sheet":"6","index":9,"n_rows":41,"n_cols":15,"rows_kept":41,"cut":false,"hidden":false,"merged":[[5,4,6,4],[5,3,6,3],[5,2,6,2],[15,8,16,8],[15,12,16,12]]}
[6,"Finished",null,null,null,null,"Navigator",null,"Solution",null,"Predicted Above"]
[null,null,null,null,null,null,null,"(a)","Claim","Actual",0.5,0.25]
["Points","A logistic model was built to predict the probability of a claim being fraudulent. Consider the",null,null,null,null,null,null,1,{"$f":"D8","v":"Y"},{"$f":"IF(E8>50%,\"Y\",\"N\")","v":"N"},{"$f":"IF(E8>25%,\"Y\",\"N\")","v":"N"}]
[{"$f":"INDEX('Point Grid'!B:B,MATCH('6'!A1,'Point Grid'!A:A,0))","v":3.5},"predicted probabilities for the 10 claims below to be a representative sample of the total ",null,null,null,null,null,null,2,{"$f":"D9","v":"N"},{"$f":"IF(E9>50%,\"Y\",\"N\")","v":"N"},{"$f":"IF(E9>25%,\"Y\",\"N\")","v":"N"}]
[null,"model.",null,null,null,null,null,null,3,"N","N","N"]
[null,null,"Claim Number","Actual Fraud Indicator","Predicted Probability of Fraud",null,null,null,4,"N","Y","Y"]
{"$rows_left_out":36}
{"sheet":"7","index":10,"n_rows":18,"n_cols":14,"rows_kept":18,"cut":false,"hidden":false,"merged":[[0,6,0,7]]}
[7,"Finished",null,null,null,null,"Navigator",null,null,"Solution"]
[null,null,null,null,null,null,null,null,"(a)","Risk Load"]
["Points","Given the following information:"]
[{"$f":"INDEX('Point Grid'!B:B,MATCH('7'!A1,'Point Grid'!A:A,0))","v":1.75},"• Allocated loss adjustment expense is 15% of the indemnity amount.",null,null,null,null,null,null,null,"L = 1,000","Risk Load",{"$f":"0.000064*E9","v":50.567871999999994}]
[null,"• The variance method has been selected to include a risk load in the",null,null,null,null,null,null,null,"L = 5,000","Risk Load",{"$f":"0.000064*E10","v":605.91718400000002}]
[null,"   Increased Limits Factors (ILFs) with k = 0.000064 and δ = 0."]
{"$rows_left_out":13}
{"sheet":"8","index":11,"n_rows":23,"n_cols":14,"rows_kept":23,"cut":false,"hidden":false,"merged":[]}
[8,"Finished",null,null,null,null,"Navigator",null,"Solution"]
[null,null,null,null,null,null,null,"(a)","Current Layer Frequency = F(10,000) - F(5,000) =",null,null,null,null,{"$f":"D11-D8","v":8.7999999999999967E-2}]
["Points","An insurer sells coverage with an attachment point of 5,000 and a layer limit of 5,000."]
[{"$f":"INDEX('Point Grid'!B:B,MATCH('8'!A1,'Point Grid'!A:A,0))","v":1.75},"The following table represents the expected cumulative severity distribution and limited",null,null,null,null,null,null,"Due to the severity increase, a claim that was 10,000 this year is now 11,000."]
[null,"expected severity for the current year at various limits.",null,null,null,null,null,null,"This means the layer 5,000 to 10,000 next year corresponds to the layer"]
[null,null,"L","F(L)","E[X; L]",null,null,null,"5,000/1.1 to 10,000/1.1 this year."]
{"$rows_left_out":18}
{"sheet":"9","index":12,"n_rows":43,"n_cols":19,"rows_kept":43,"cut":false,"hidden":false,"merged":[]}
[9,"Finished",null,null,null,null,null,null,"Navigator",null,"Solution"]
[null,null,null,null,null,null,null,null,null,"(a)","The experience period is the three years prior to 1/1/17, lagged by one year. Namely,"]
["Points","Consider the following claims-made commercial general liability policy:",null,null,null,null,null,null,null,null,"1/1/13 – 12/31/15."]
[{"$f":"INDEX('Point Grid'!B:B,MATCH('9'!A1,'Point Grid'!A:A,0))","v":3.25},"• The insurance contract was originally written January 1, 2011, and has been ",null,null,null,null,null,null,null,null,"First we need the CSLC (Company Subject Loss Cost). "]
[null,"   renewed annually as a claims-made policy.",null,null,null,null,null,null,null,null,"Notice there's only one type of policy, Prem/Ops, and since it started in 2011, the 2017 policy is mature."]
[null,"• The annual Premises/Operations basic limits manual premium is $200,000 and",null,null,null,null,null,null,null,null,"Also, observe there's no mention of a special underwriting basis so use the standard approach with Table 14, Rule 5B."]
{"$rows_left_out":38}
{"sheet":"10","index":13,"n_rows":14,"n_cols":16,"rows_kept":14,"cut":false,"hidden":false,"merged":[[0,6,0,7]]}
[10,"Finished",null,null,null,null,"Navigator",null,null,"Solution"]
[null,null,null,null,null,null,null,null,"(a)","Since the most recent prior year is not included in the experience period, only the first year"]
["Points","An actuary is evaluating a risk to determine the appropriateness of applying any schedule",null,null,null,null,null,null,null,"of the safety program being removed is included in the three years of experience."]
[{"$f":"INDEX('Point Grid'!B:B,MATCH('10'!A1,'Point Grid'!A:A,0))","v":1},"credits or debits. In order to reduce expenses the insured removed a safety program ",null,null,null,null,null,null,null,"Therefore, apply a debit of 2/3 of the maximum debit for removing the safety program."]
[null,"two years ago and in the next month will be reducing its staff.",null,null,null,null,null,null,null,"Safety Program",null,{"$f":"10%*2/3","v":6.6666666666666666E-2},"debit"]
[]
{"$rows_left_out":9}
{"sheet":"11","index":14,"n_rows":37,"n_cols":14,"rows_kept":37,"cut":false,"hidden":false,"merged":[[0,6,0,7],[9,2,10,2],[9,1,10,1],[19,6,20,6],[9,6,10,6],[9,5,10,5],[9,4,10,4],[9,3,10,3],[19,1,20,1],[19,2,20,2],[19,3,20,3],[19,4,20,4],[19,5,20,5]]}
[11,"Finished",null,null,null,null,"Navigator",null,null,"Solution"]
[null,null,null,null,null,null,null,null,"(a)","Since the values are given in thousands throughout the tables, we can ignore the thousands for now."]
["Points","A Workers' Compensation insurer is facing an increasingly competitive market. "]
[{"$f":"INDEX('Point Grid'!B:B,MATCH('11'!A1,'Point Grid'!A:A,0))","v":2.5},"Its management is concerned about customer retention, premium growth, and loss ratio",null,null,null,null,null,null,null,"Efficiency Statistic = Sample Variance of Standard Loss Ratios / Sample Variance of Manual Loss Ratios"]
[null,"deterioration. The insurer's actuaries have proposed an updated experience rating plan."]
[null,"After grouping insureds for the purposes of an efficiency test, the projected impact of",null,null,null,null,null,null,null,"Current Plan"]
{"$rows_left_out":32}
{"sheet":"12","index":15,"n_rows":51,"n_cols":9,"rows_kept":51,"cut":false,"hidden":false,"merged":[]}
[12,"Finished",null,null,null,null,"Navigator",null,"Solution"]
[null,null,null,null,null,null,null,"(a)","Alice: \"This isn't really a fair question for the new Computer Based Testing environment"]
["Points","A policy has a flat dollar deductible of M and a maximum payout on a loss by the insurer of N.",null,null,null,null,null,null,"Nevertheless, it's an important topic to understand so you should make sure you know"]
[{"$f":"INDEX('Point Grid'!B:B,MATCH('12'!A1,'Point Grid'!A:A,0))","v":3.25},null,null,null,null,null,null,null,"how to do it.\""]
[]
["(a)","Draw a Lee diagram representing the expected amount of loss incurred by this policy."]
{"$rows_left_out":46}
{"sheet":"13","index":16,"n_rows":42,"n_cols":14,"rows_kept":42,"cut":false,"hidden":false,"merged":[[10,2,11,2],[10,4,11,4],[10,3,11,3],[10,1,11,1],[24,2,25,2],[24,1,25,1]]}
[13,"Finished",null,null,null,null,"Navigator",null,"Solution"]
[null,null,null,null,null,null,null,"(a)","The maximum premium that can be charged is given by B + c*LG, where B is the basic premium"]
["Points","A risk is written using a balanced retrospective rating plan with the following characteristics:",null,null,null,null,null,null,"c, is the loss conversion factor, and LG is the maximum ratable loss."]
[{"$f":"INDEX('Point Grid'!B:B,MATCH('13'!A1,'Point Grid'!A:A,0))","v":2.5},"• Losses at the minimum premium = $50,000"]
[null,"• Losses at the maximum premium = $300,000",null,null,null,null,null,null,"We need to find B = e - (c-1)*E + cI"]
[null,"• Loss conversion factor = 1.05",null,null,null,null,null,null,"where E is the expected aggregate loss and I is the net insurance charge."]
{"$rows_left_out":37}
{"sheet":"14","index":17,"n_rows":38,"n_cols":13,"rows_kept":38,"cut":false,"hidden":false,"merged":[[4,2,5,2],[4,1,5,1],[4,3,5,3]]}
[14,"Finished",null,null,null,null,"Navigator",null,"Solution"]
[null,null,null,null,null,null,null,"(a)"]
["Points","A reinsurer has been supplied the following information from a large insurance company:"]
[{"$f":"INDEX('Point Grid'!B:B,MATCH('14'!A1,'Point Grid'!A:A,0))","v":3},null,null,null,null,null,null,null,"E[X] =",{"$f":"D12*1000/C12","v":500000}]
[null,"Claim Size Range","Expected Number of Claims","Expected Ultimate Losses ($000)",null,null,null,null,"E[X; 1m] =",{"$f":"(D7*1000+SUM(C8:C11)*10^6)/C12","v":387525},null,"e(1m) =",{"$f":"($J$4-J5)/(1-SUM(C7:$C$7)/$C$12)","v":2249499.9999999981}]
[null,null,null,null,null,null,null,null,"E[X; 2m] =",{"$f":"(SUM(D7:D8)*1000+SUM(C9:C11)*2*10^6)/C12","v":427890},null,"e(2m) =",{"$f":"($J$4-J6)/(1-SUM(C$7:$C8)/$C$12)","v":2249921.9968798738}]
{"$rows_left_out":33}
{"sheet":"15","index":18,"n_rows":41,"n_cols":14,"rows_kept":41,"cut":false,"hidden":false,"merged":[[0,7,0,8]]}
[15,"Finished",null,null,null,null,null,"Navigator",null,null,"Solution"]
[null,null,null,null,null,null,null,null,null,"(a)","Tax multiplier = ",null,{"$f":"1/(1-E10)","v":1.0309278350515465}]
["Points","The following applies to an incurred loss retrospectively rated policy effective January 1, 2017.",null,null,null,null,null,null,null,null,"Loss conversion factor = ",null,null,{"$f":"1+E7","v":1.08}]
[{"$f":"INDEX('Point Grid'!B:B,MATCH('15'!A1,'Point Grid'!A:A,0))","v":3.25}]
[null,"Per-occurrence limit",null,null,150000,null,null,null,null,null,"Retrospective Premium = (B + cL)*T"]
[null,"Maximum ratable loss",null,null,600000]
{"$rows_left_out":36}
{"sheet":"16","index":19,"n_rows":15,"n_cols":9,"rows_kept":15,"cut":false,"hidden":false,"merged":[[0,5,0,6]]}
[16,"Finished",null,null,null,"Navigator",null,null,"Solution"]
[null,null,null,null,null,null,null,"(a)","1. If there is insufficient data then the resulting distribution may have significant bias and not"]
["Points","An insurance company generally uses two different methods to price excess layer",null,null,null,null,null,null,"     reflect reality."]
[{"$f":"INDEX('Point Grid'!B:B,MATCH('16'!A1,'Point Grid'!A:A,0))","v":1.75},"insurance contracts:",null,null,null,null,null,null,"2. Continuous approximation models require intensive calculation which can be time consuming and costly."]
[null,"   • Empirical construction of Table M; or"]
[null,"   • Approximating the distribution of aggregate losses with a continuous approximation ",null,null,null,null,null,"(b)","1. Divide the available data into homogeneous risk groups based on similar size policies for example."]
{"$rows_left_out":10}
{"sheet":"17","index":20,"n_rows":35,"n_cols":15,"rows_kept":35,"cut":false,"hidden":false,"merged":[[0,7,0,8]]}
[17,"Finished",null,null,null,null,null,"Navigator",null,null,"Solution"]
[null,null,null,null,null,null,null,null,null,"(a)"]
["Points","A Workers' Compensation policy has the following limits and expected losses:"]
[{"$f":"INDEX('Point Grid'!B:B,MATCH('17'!A1,'Point Grid'!A:A,0))","v":2},null,null,null,null,null,null,null,null,null,"k = ",{"$f":"(E6-E7)/E6","v":0.2857142857142857}]
[null,"Per-Occurrence Limit",null,null,300000]
[null,"Expected Unlimited Aggregate Losses",null,null,700000]
{"$rows_left_out":30}
{"sheet":"18","index":21,"n_rows":54,"n_cols":18,"rows_kept":54,"cut":false,"hidden":false,"merged":[[0,9,0,11],[8,2,8,5],[9,2,9,5],[3,1,4,1],[3,2,4,5],[5,2,5,5],[6,2,6,5],[7,2,7,5]]}
[18,"Finished",null,null,null,null,null,null,null,"Navigator",null,null,null,"Solution"]
[null,null,null,null,null,null,null,null,null,null,null,null,"(a)",null,"where L is the limited expected value function."]
["Points","A homogeneous group of property risks exhibit the following risk profile:"]
[{"$f":"INDEX('Point Grid'!B:B,MATCH('18'!A1,'Point Grid'!A:A,0))","v":3.25},"Exposure Distribution","Losses as a percent of the Maximum Possible Loss (MPL)",null,null,null,null,null,null,null,null,null,null,"Loss (% of MPL)","Probabililty","(given a loss occurred)"]
[null,null,null,null,null,null,null,null,null,null,null,null,null,0.25,{"$f":"B7/(1-$B$6)","v":0.30000000000000004}]
[null,0.8,0,null,null,null,null,null,null,null,null,null,null,0.5,{"$f":"B8/(1-$B$6)","v":0.40000000000000008}]
{"$rows_left_out":49}
{"sheet":"19","index":22,"n_rows":29,"n_cols":16,"rows_kept":29,"cut":false,"hidden":false,"merged":[[0,6,0,7],[10,6,11,6],[10,2,11,2],[10,1,11,1],[10,3,11,3],[10,4,11,4],[10,5,11,5]]}
[19,"Finished",null,null,null,null,"Navigator",null,null,"Solution"]
[null,null,null,null,null,null,null,null,"(a)","Retention",500000,null,"Limit",500000]
["Points","A primary insurer wants to institute a swing plan with the following terms:"]
[{"$f":"INDEX('Point Grid'!B:B,MATCH('19'!A1,'Point Grid'!A:A,0))","v":3},"   • Layer: $500,000 xs $500,000 per claim",null,null,null,null,null,null,null,"Year","Layer Loss","Premium","Loss Ratio"]
[null,"   • Premium = Layer Losses * 1.3",null,null,null,null,null,null,null,2012,{"$f":"MAX(0,MIN($N$2,D13-$K$2))+MAX(0,MIN($N$2,E13-$K$2))+MAX(0,MIN($N$2,F13-$K$2))+MAX(0,MIN($N$2,G13-$K$2))","v":12017},{"$f":"IF(K5*1.3<100000,100000,IF(K5*1.3>325000,325000,K5*1.3))","v":100000},{"$f":"K5/L5","v":0.12017}]
[null,"   •  Minimum Premium = $100,000",null,null,null,null,null,null,null,2013,{"$f":"MAX(0,MIN($N$2,D14-$K$2))+MAX(0,MIN($N$2,E14-$K$2))+MAX(0,MIN($N$2,F14-$K$2))+MAX(0,MIN($N$2,G14-$K$2))","v":0},{"$f":"IF(K6*1.3<100000,100000,IF(K6*1.3>325000,325000,K6*1.3))","v":100000},{"$f":"K6/L6","v":0}]
{"$rows_left_out":24}
{"sheet":"20","index":23,"n_rows":35,"n_cols":12,"rows_kept":35,"cut":false,"hidden":false,"merged":[[0,5,0,6]]}
[20,"Finished",null,null,null,"Navigator",null,null,"Solution"]
[null,null,null,null,null,null,null,"(a)","A is the damage ratio at each intensity (the damage ratio curve)."]
["Points","An earthquake model produces the following damage function for a $1,000,000 home in",null,null,null,null,null,null,"B is the uncertainty in the damage ratio at the given intensities."]
[{"$f":"INDEX('Point Grid'!B:B,MATCH('20'!A1,'Point Grid'!A:A,0))","v":2.5},"California:",null,null,null,null,null,null,"C is the probability distribution for the earthquake intensity felt by the home given "]
[null,null,null,null,null,null,null,null,"a particular earthquake has occurred."]
[]
{"$rows_left_out":29}