{"text_format":"1","workbook":"xlsx","n_sheets":24,"sheets":["Instructions","Formula Sheet","Point Grid","Navigator","1","2","3","4","5","6","7","8","9","10","11","12","13","14","15","16","17","18","19","20"],"not_rendered":{"charts":0,"images":4,"macros":1,"external_links":0,"defined_names":0,"comments":0,"pivot_tables":0},"unopened":[],"bounds":{"document_bytes":16777216,"sheet_cells":100000,"rows_first":2000,"rows_last":500,"rows_between":2000,"halvings":0,"cell_chars":16384,"cell_head_chars":4096},"cells_cut":0,"cells_raw":0,"read":"whole","date_system":"1900"}

{"sheet":"Instructions","index":0,"n_rows":32,"n_cols":1,"rows_kept":32,"cut":false,"hidden":false,"merged":[]}
[]
[]
[]
[]
[]
["Instructions"]
[]
["1.) Find a quiet place and allow yourself the full four hour exam period to practice. Treat this just as you would the real exam."]
[]
["2.) Use the Navigator worksheet to see a brief description of each question, its point value and navigate between questions in your preferred order."]
[]
["3.) Answer each question either to the side or below the grey question area."]
[]
["4.) Use cell B1 on each question worksheet to mark whether you finished the question or not. You should use this feature to"]
["       reflect your confidence in your answer. This way you'll know if you're on the money or your guesses were lucky."]
{"$rows_left_out":18}
{"sheet":"Formula Sheet","index":1,"n_rows":27,"n_cols":2,"rows_kept":27,"cut":false,"hidden":true,"merged":[]}
[]
[]
[]
[]
[]
["FORMULA SHEET"]
[]
["• For the negative binomial distribution (for use on question 3):"]
[]
[null,"○"]
[]
[]
[null,"○"]
[]
[]
{"$rows_left_out":13}
{"sheet":"Point Grid","index":2,"n_rows":31,"n_cols":19,"rows_kept":31,"cut":false,"hidden":false,"merged":[[5,1,6,1]]}
[]
[]
[]
[]
["2017 Exam 8"]
[null,"Total Point Value","Sub-Part of Question",null,null,null,null,null,null,null,null,"Your Score","Sub-Part of Question"]
["Question",null,"(a)","(b)","(c)","(d)","(e)","(f)","(g)","Status",null,"Question","(a)","(b)","(c)","(d)","(e)","(f)","(g)"]
[1,{"$f":"SUM(C8:I8)","v":8.5},1.5,2,1.5,1.5,1,1,null,{"$f":"INDIRECT(\"'\"&A8&\"'!B1\")","v":"Incomplete"},null,{"$f":"A8","v":1},{"$f":"_xlfn.IFNA(IF(ISBLANK(INDEX(INDIRECT(\"'\"&$L8&\"'!$A:$A\"),MATCH(M$7,INDIRECT(\"'\"&$L8&\"'!$A:$A\"),0)+2)),\"\",INDEX(INDIRECT(\"'\"&$L8&\"'!$A:$A\"),MATCH(M$7,INDIRECT(\"'\"&$L8&\"'!$A:$A\"),0)+2)),\"\")","v":""},"","","","","",""]
[2,{"$f":"SUM(C9:I9)","v":2},1.75,0.25,null,null,null,null,null,{"$f":"INDIRECT(\"'\"&A9&\"'!B1\")","v":"Incomplete"},null,{"$f":"A9","v":2},"","","","","","",""]
[3,1.5,0.75,0.75,null,null,null,null,null,"Incomplete",null,3,"","","","","","",""]
[4,1.75,0.5,0.75,0.5,null,null,null,null,"Incomplete",null,4,"","","","","","",""]
[5,1.75,1.75,null,null,null,null,null,null,"Incomplete",null,5,"","","","","","",""]
[6,3.5,1,1.5,0.5,0.5,null,null,null,"Incomplete",null,6,"","","","","","",""]
[7,1.75,1,0.75,null,null,null,null,null,"Incomplete",null,7,"","","","","","",""]
[8,1.75,0.75,1,null,null,null,null,null,"Incomplete",null,8,"","","","","","",""]
{"$rows_left_out":17}
{"sheet":"Navigator","index":3,"n_rows":28,"n_cols":8,"rows_kept":28,"cut":false,"hidden":false,"merged":[[19,0,19,6],[8,0,8,6],[9,0,9,6],[10,0,10,6],[11,0,11,6],[12,0,12,6],[13,0,13,6],[14,0,14,6],[15,0,15,6],[16,0,16,6],[17,0,17,6],[18,0,18,6],[26,0,26,6],[27,0,27,6],[20,0,20,6],[21,0,21,6],[22,0,22,6],[23,0,23,6],[24,0,24,6],[25,0,25,6]]}
[]
[]
[]
[]
[]
["Navigator – Select a question to go to it"]
[]
["Question #",null,null,null,null,null,null,"Status"]
["Q1 -- Goldburd (GLM) -- Variable Selection (IQ) -- 8.50 points",null,null,null,null,null,null,{"$f":"'Point Grid'!J8","v":"Incomplete"}]
["Q2 -- Robertson -- Weighted k-means -- 2.00 points",null,null,null,null,null,null,{"$f":"'Point Grid'!J9","v":"Incomplete"}]
["Q3 -- Bailey & Simon -- Relative Credibility -- 1.50 points",null,null,null,null,null,null,{"$f":"'Point Grid'!J10","v":"Incomplete"}]
["Q4 -- Goldburd (GLM) -- Model Selection -- 1.75 points",null,null,null,null,null,null,{"$f":"'Point Grid'!J11","v":"Incomplete"}]
["Q5 -- Goldburd (GLM) -- Null, Saturated & Practical Models -- 1.75 points",null,null,null,null,null,null,{"$f":"'Point Grid'!J12","v":"Incomplete"}]
["Q6 -- Goldburd (GLM) -- Logistic Regression --3.50 points",null,null,null,null,null,null,{"$f":"'Point Grid'!J13","v":"Incomplete"}]
["Q7 -- Bahnemann -- Risk Loaded ILFs -- 1.75 points",null,null,null,null,null,null,{"$f":"'Point Grid'!J14","v":"Incomplete"}]
{"$rows_left_out":14}
{"sheet":"1","index":4,"n_rows":81,"n_cols":11,"rows_kept":81,"cut":false,"hidden":false,"merged":[[0,7,0,8]]}
[1,"Incomplete",null,null,null,null,null,"Navigator",null,null,"Solution"]
[]
["Points","An actuary has constructed a pure premium model using the Tweedie distribution with parameter"]
[{"$f":"INDEX('Point Grid'!B:B,MATCH('1'!A1,'Point Grid'!A:A,0))","v":8.5},"1 < p < 2 to determine manual rates for a Workers' Compensation book of business. The output of the model "]
[null,"is pure premium per $100 of payroll."]
[]
[null,"The following variables were considered for inclusion in the model:"]
[null,"Variable",null,"Description or Source of Data",null,null,"p-value"]
[null,"Industry",null,"Construction, Manufacturing, All Other",null,null,2E-3]
[null,"Return to Work Program",null,"Yes or No",null,null,8.0000000000000002E-3]
[null,"Employee Age",null,"Average Age in Years",null,null,3.0000000000000001E-3]
[null,"Employee Tenure",null,"Average Number of Years of Employment",null,null,5.0000000000000001E-3]
[null,"Location",null,"State of Jurisdiction",null,null,0.08]
[null,"Employee Morale",null,"Based on Results of Annual Company Survey",null,null,0.15]
[null,"Number of Back Injuries",null,"Supplied by Employer",null,null,0.01]
{"$rows_left_out":67}
{"sheet":"2","index":5,"n_rows":24,"n_cols":11,"rows_kept":24,"cut":false,"hidden":false,"merged":[[6,1,8,1],[0,7,0,8],[6,2,8,2],[6,3,8,3],[6,4,8,4],[6,5,8,5]]}
[2,"Incomplete",null,null,null,null,null,"Navigator",null,null,"Solution"]
[]
["Points","An actuary wants to cluster five Workers' Compensation classes based on excess ratios at"]
[{"$f":"INDEX('Point Grid'!B:B,MATCH('2'!A1,'Point Grid'!A:A,0))","v":2},"two limits: 500,000 and 1,000,000. The actuary decides to use a weighted k-means"]
[null,"algorithm with two clusters. Given the following:"]
[]
[null,"Class","On-Leveled Earned Premium ($000)","Normalized Excess Ratio at 500,000 Limit","Normalized Excess Ratio at 1,000,000 Limit","Initial Cluster"]
[]
[]
[null,1,6500,0.24,0.08,"A"]
[null,2,5000,0.35,0.2,"A"]
[null,3,4000,0.21,0.08,"A"]
[null,4,3000,0.11,0.03,"A"]
[null,5,5000,0.18,7.0000000000000007E-2,"B"]
[]
{"$rows_left_out":10}
{"sheet":"3","index":6,"n_rows":24,"n_cols":8,"rows_kept":24,"cut":false,"hidden":false,"merged":[[5,1,6,1],[5,2,6,2],[5,3,6,3],[5,4,6,4]]}
[3,"Incomplete",null,null,null,"Navigator",null,"Solution"]
[]
["Points","The following data shows the experience of a merit rating plan for private passenger "]
[{"$f":"INDEX('Point Grid'!B:B,MATCH('3'!A1,'Point Grid'!A:A,0))","v":1.5},"vehicles. The merit rating plan uses multiple rating variables, including territory."]
[]
[null,"Number of Accident-Free Years","Earned Car Years (000s)","Earned Premium ($000s)","Number of Incurred Claims"]
[]
[null,"5 or More",250,500000,15000]
[null,"3 and 4",100,90000,13500]
[null,"1 and 2",80,60000,8000]
[null,0,70,50000,10500]
[null,"Total",{"$f":"SUM(C8:C11)","v":500},{"$f":"SUM(D8:D11)","v":700000},{"$f":"SUM(E8:E11)","v":47000}]
[]
[null,"Territory","Frequency","Average Premium"]
[null,"A",0.05,1500]
{"$rows_left_out":10}
{"sheet":"4","index":7,"n_rows":35,"n_cols":9,"rows_kept":35,"cut":false,"hidden":false,"merged":[]}
[4,"Incomplete",null,null,null,null,"Navigator",null,"Solution"]
[]
["Points","An actuary has split data into training and test groups for a model. The chart below shows"]
[{"$f":"INDEX('Point Grid'!B:B,MATCH('4'!A1,'Point Grid'!A:A,0))","v":1.75},"the relationship between model performance and model complexity. Model performance"]
[null,"is represented by model error and model complexity is represented by degrees of freedom."]
[]
[]
[]
[]
[]
[]
[]
[]
[]
[]
{"$rows_left_out":21}
{"sheet":"5","index":8,"n_rows":10,"n_cols":9,"rows_kept":10,"cut":false,"hidden":false,"merged":[]}
[5,"Incomplete",null,null,null,null,"Navigator",null,"Solution"]
[]
["Points","An analyst has fit several different variations of a logistic GLM to a data set containing 1,000"]
[{"$f":"INDEX('Point Grid'!B:B,MATCH('5'!A1,'Point Grid'!A:A,0))","v":1.75},"records of fraudulent claims and 9,000 records of legitimate claims. For each model variation"]
[null,"listed below, draw a quintile plot based on the training data. Label the axes and identify each"]
[null,"data series."]
[]
["(a)","   i. A saturated model"]
[{"$f":"INDEX('Point Grid'!$C$8:$I$29,MATCH($A$1,'Point Grid'!$A$8:$A$29,0),MATCH(A8,'Point Grid'!$C$7:$I$7,0))","v":1.75},"  ii. A null model"]
[null," iii. A model that could be used in practice"]

{"sheet":"6","index":9,"n_rows":32,"n_cols":9,"rows_kept":32,"cut":false,"hidden":false,"merged":[[5,4,6,4],[5,3,6,3],[5,2,6,2]]}
[6,"Incomplete",null,null,null,null,"Navigator",null,"Solution"]
[]
["Points","A logistic model was built to predict the probability of a claim being fraudulent. Consider the"]
[{"$f":"INDEX('Point Grid'!B:B,MATCH('6'!A1,'Point Grid'!A:A,0))","v":3.5},"predicted probabilities for the 10 claims below to be a representative sample of the total "]
[null,"model."]
[null,null,"Claim Number","Actual Fraud Indicator","Predicted Probability of Fraud"]
[]
[null,null,1,"Y",0.11]
[null,null,2,"N",0.23]
[null,null,3,"N",0.15]
[null,null,4,"N",0.7]
[null,null,5,"Y",0.91]
[null,null,6,"Y",0.3]
[null,null,7,"N",0.11]
[null,null,8,"Y",0.75]
{"$rows_left_out":18}
{"sheet":"7","index":10,"n_rows":18,"n_cols":10,"rows_kept":18,"cut":false,"hidden":false,"merged":[]}
[7,"Incomplete",null,null,null,null,null,"Navigator",null,"Solution"]
[]
["Points","Given the following information:"]
[{"$f":"INDEX('Point Grid'!B:B,MATCH('7'!A1,'Point Grid'!A:A,0))","v":1.75},"• Allocated loss adjustment expense is 15% of the indemnity amount."]
[null,"• The variance method has been selected to include a risk load in the"]
[null,"   Increased Limits Factors (ILFs) with k = 0.000064 and δ = 0."]
[]
[null,null,"Limit, L","E[X; L]","E[X2; L]"]
[null,null,1000,840,790123]
[null,null,5000,2485,9467456]
[]
["(a)","Calculate the following:"]
[{"$f":"INDEX('Point Grid'!$C$8:$I$29,MATCH($A$1,'Point Grid'!$A$8:$A$29,0),MATCH(A12,'Point Grid'!$C$7:$I$7,0))","v":1},"• The risk loads for each limit."]
[null,"• The ILF with and without risk load for the 5,000 limit."]
[]
{"$rows_left_out":4}
{"sheet":"8","index":11,"n_rows":21,"n_cols":9,"rows_kept":21,"cut":false,"hidden":false,"merged":[]}
[8,"Incomplete",null,null,null,null,"Navigator",null,"Solution"]
[]
["Points","An insurer sells coverage with an attachment point of 5,000 and a layer limit of 5,000."]
[{"$f":"INDEX('Point Grid'!B:B,MATCH('8'!A1,'Point Grid'!A:A,0))","v":1.75},"The following table represents the expected cumulative severity distribution and limited"]
[null,"expected severity for the current year at various limits."]
[null,null,"L","F(L)","E[X; L]"]
[null,null,4545,0.84199999999999997,1807]
[null,null,5000,0.85899999999999999,1875]
[null,null,5500,0.875,1941]
[null,null,9091,0.93799999999999994,2256]
[null,null,10000,0.94699999999999995,2308]
[null,null,11000,0.95399999999999996,2357]
[]
[null,"The actuary expects a 10% severity increase for all claim sizes next year."]
[]
{"$rows_left_out":7}
{"sheet":"9","index":12,"n_rows":42,"n_cols":11,"rows_kept":42,"cut":false,"hidden":false,"merged":[]}
[9,"Incomplete",null,null,null,null,null,null,"Navigator",null,"Solution"]
[]
["Points","Consider the following claims-made commercial general liability policy:"]
[{"$f":"INDEX('Point Grid'!B:B,MATCH('9'!A1,'Point Grid'!A:A,0))","v":3.25},"• The insurance contract was originally written January 1, 2011, and has been "]
[null,"   renewed annually as a claims-made policy."]
[null,"• The annual Premises/Operations basic limits manual premium is $200,000 and"]
[null,"   there is no products exposure."]
[null,"• The expected loss ratio is 70%."]
[null,"• Loss experience is evaluated as of June 30, 2016."]
[]
[null,"Claim Number","Policy Year","Indemnity","ALAE"]
[null,1,2011,5000,5000]
[null,2,2012,15000,25000]
[null,3,2013,58000,0]
[null,4,2013,20000,85000]
{"$rows_left_out":28}
{"sheet":"10","index":13,"n_rows":13,"n_cols":10,"rows_kept":13,"cut":false,"hidden":false,"merged":[[0,6,0,7]]}
[10,"Incomplete",null,null,null,null,"Navigator",null,null,"Solution"]
[]
["Points","An actuary is evaluating a risk to determine the appropriateness of applying any schedule"]
[{"$f":"INDEX('Point Grid'!B:B,MATCH('10'!A1,'Point Grid'!A:A,0))","v":1},"credits or debits. In order to reduce expenses the insured removed a safety program "]
[null,"two years ago and in the next month will be reducing its staff."]
[]
[null,null,null,"Range of Modifications"]
[null,"Risk Characteristic","Description","Credit",null,"Debit"]
[null,"Cooperation","Safety Program",0.1,"to",0.1]
[null,"Employees","Selection, training, supervision, experience",0.05,"to",0.05]
[]
["(a)","Recommend and defend an appropriate schedule modification."]
[{"$f":"INDEX('Point Grid'!$C$8:$I$29,MATCH($A$1,'Point Grid'!$A$8:$A$29,0),MATCH(A12,'Point Grid'!$C$7:$I$7,0))","v":1}]

{"sheet":"11","index":14,"n_rows":36,"n_cols":10,"rows_kept":36,"cut":false,"hidden":false,"merged":[[0,6,0,7],[9,2,10,2],[9,1,10,1],[19,6,20,6],[9,6,10,6],[9,5,10,5],[9,4,10,4],[9,3,10,3],[19,1,20,1],[19,2,20,2],[19,3,20,3],[19,4,20,4],[19,5,20,5]]}
[11,"Incomplete",null,null,null,null,"Navigator",null,null,"Solution"]
[]
["Points","A Workers' Compensation insurer is facing an increasingly competitive market. "]
[{"$f":"INDEX('Point Grid'!B:B,MATCH('11'!A1,'Point Grid'!A:A,0))","v":2.5},"Its management is concerned about customer retention, premium growth, and loss ratio"]
[null,"deterioration. The insurer's actuaries have proposed an updated experience rating plan."]
[null,"After grouping insureds for the purposes of an efficiency test, the projected impact of"]
[null,"this proposal is below (values in thousands):"]
[]
[null,"Current Plan"]
[null,"Quintile","Manual Premium","Loss","Standard Premium","Loss Ratio to Manual","Loss Ratio to Standard"]
[]
[null,"A",4750,1978,3278,0.42,0.6]
[null,"B",4825,2824,4005,0.59,0.71]
[null,"C",4450,2915,4450,0.66,0.66]
[null,"D",4845,3608,5378,0.74,0.67]
{"$rows_left_out":22}
{"sheet":"12","index":15,"n_rows":23,"n_cols":9,"rows_kept":23,"cut":false,"hidden":false,"merged":[]}
[12,"Incomplete",null,null,null,null,"Navigator",null,"Solution"]
[]
["Points","A policy has a flat dollar deductible of M and a maximum payout on a loss by the insurer of N."]
[{"$f":"INDEX('Point Grid'!B:B,MATCH('12'!A1,'Point Grid'!A:A,0))","v":3.25}]
[]
["(a)","Draw a Lee diagram representing the expected amount of loss incurred by this policy."]
[{"$f":"INDEX('Point Grid'!$C$8:$I$29,MATCH($A$1,'Point Grid'!$A$8:$A$29,0),MATCH(A6,'Point Grid'!$C$7:$I$7,0))","v":1},"Label the following:"]
[null,"   i. The axes"]
[null,"  ii. The deductible amount"]
[null," iii. The policy limit"]
[null," iv. The expected insured loss."]
[]
["(b)","Assume cumulative losses follow a distribution F(x). Write the formula for covered losses"]
[{"$f":"INDEX('Point Grid'!$C$8:$I$29,MATCH($A$1,'Point Grid'!$A$8:$A$29,0),MATCH(A13,'Point Grid'!$C$7:$I$7,0))","v":0.5},"for this policy using:"]
[null,"   i. The layer method"]
{"$rows_left_out":9}
{"sheet":"13","index":16,"n_rows":35,"n_cols":9,"rows_kept":35,"cut":false,"hidden":false,"merged":[[10,2,11,2],[10,4,11,4],[10,3,11,3],[10,1,11,1],[24,2,25,2],[24,1,25,1]]}
[13,"Incomplete",null,null,null,null,"Navigator",null,"Solution"]
[]
["Points","A risk is written using a balanced retrospective rating plan with the following characteristics:"]
[{"$f":"INDEX('Point Grid'!B:B,MATCH('13'!A1,'Point Grid'!A:A,0))","v":2.5},"• Losses at the minimum premium = $50,000"]
[null,"• Losses at the maximum premium = $300,000"]
[null,"• Loss conversion factor = 1.05"]
[null,"• e = $10,000"]
[]
[null,"The following table shows actual experience from a representative sample of risks that are"]
[null,"similar to the risk in question:"]
[null,"Risk","Actual Aggregate Loss","Risk","Actual Aggregate Loss"]
[]
[null,1,25000,6,175000]
[null,2,50000,7,200000]
[null,3,100000,8,300000]
{"$rows_left_out":21}
{"sheet":"14","index":17,"n_rows":22,"n_cols":9,"rows_kept":22,"cut":false,"hidden":false,"merged":[[4,2,5,2],[4,1,5,1],[4,3,5,3]]}
[14,"Incomplete",null,null,null,null,"Navigator",null,"Solution"]
[]
["Points","A reinsurer has been supplied the following information from a large insurance company:"]
[{"$f":"INDEX('Point Grid'!B:B,MATCH('14'!A1,'Point Grid'!A:A,0))","v":3}]
[null,"Claim Size Range","Expected Number of Claims","Expected Ultimate Losses ($000)"]
[]
[null,"$0 to $1,000,000",19000,6750500]
[null,"$1,000,001 to $2,000,000",359,525300]
[null,"$2,000,001 to $3,000,000",230,566500]
[null,"$3,000,001 to $4,000,000",147,507700]
[null,"above $4,000,001",264,1650000]
[null,"Total",{"$f":"SUM(C7:C11)","v":20000},{"$f":"SUM(D7:D11)","v":10000000}]
[]
[null,"The reinsurer is entering into an excess of loss contract with the primary insurance company."]
[null,"The reinsurer will pay all losses above a $5,000,000 per claim retention."]
{"$rows_left_out":8}
{"sheet":"15","index":18,"n_rows":32,"n_cols":11,"rows_kept":32,"cut":false,"hidden":false,"merged":[[0,7,0,8]]}
[15,"Incomplete",null,null,null,null,null,"Navigator",null,null,"Solution"]
[]
["Points","The following applies to an incurred loss retrospectively rated policy effective January 1, 2017."]
[{"$f":"INDEX('Point Grid'!B:B,MATCH('15'!A1,'Point Grid'!A:A,0))","v":3.25}]
[null,"Per-occurrence limit",null,null,150000]
[null,"Maximum ratable loss",null,null,600000]
[null,"ULAE as a percentage of loss & ALAE",null,null,0.08]
[null,"Expected Loss & ALAE limited to $150,000",null,null,400000]
[null,"Basic Premium",null,null,375000]
[null,"Tax Rate",null,null,0.03]
[]
[null,"The expected loss & ALAE limited to $150,000 is used to determine the initial premium."]
[null,"Retrospective rating adjustments start at 18 months and occur every twelve months thereafter."]
[]
[null,"The following loss experience occurs during the policy period. All claims are closed at"]
{"$rows_left_out":18}
{"sheet":"16","index":19,"n_rows":14,"n_cols":9,"rows_kept":14,"cut":false,"hidden":false,"merged":[[0,5,0,6]]}
[16,"Incomplete",null,null,null,"Navigator",null,null,"Solution"]
[]
["Points","An insurance company generally uses two different methods to price excess layer"]
[{"$f":"INDEX('Point Grid'!B:B,MATCH('16'!A1,'Point Grid'!A:A,0))","v":1.75},"insurance contracts:"]
[null,"   • Empirical construction of Table M; or"]
[null,"   • Approximating the distribution of aggregate losses with a continuous approximation "]
[null,"      model."]
[]
["(a)","Briefly describe two potential disadvantages of using a continuous approximation model."]
[{"$f":"INDEX('Point Grid'!$C$8:$I$29,MATCH($A$1,'Point Grid'!$A$8:$A$29,0),MATCH(A9,'Point Grid'!$C$7:$I$7,0))","v":0.5}]
[]
[]
["(b)","Fully describe the process of constructing an empirical Table M and estimating the "]
[{"$f":"INDEX('Point Grid'!$C$8:$I$29,MATCH($A$1,'Point Grid'!$A$8:$A$29,0),MATCH(A13,'Point Grid'!$C$7:$I$7,0))","v":1.25},"aggregate loss cost of an excess layer using the table."]

{"sheet":"17","index":20,"n_rows":34,"n_cols":11,"rows_kept":34,"cut":false,"hidden":false,"merged":[[0,7,0,8]]}
[17,"Incomplete",null,null,null,null,null,"Navigator",null,null,"Solution"]
[]
["Points","A Workers' Compensation policy has the following limits and expected losses:"]
[{"$f":"INDEX('Point Grid'!B:B,MATCH('17'!A1,'Point Grid'!A:A,0))","v":2}]
[null,"Per-Occurrence Limit",null,null,300000]
[null,"Expected Unlimited Aggregate Losses",null,null,700000]
[null,"Expected Limited Aggregate losses",null,null,500000]
[null,"Aggregate Deductible Limit",null,null,800000]
[null,"State Hazard Group Differential",null,null,0.95]
[]
[null,"Table of Expected Loss Groups"]
[null,"Expected Loss Group","Range of Values"]
[null,31,"630,000 – 720,000"]
[null,30,"720,001 – 830,000"]
[null,29,"830,001 – 990,000"]
{"$rows_left_out":20}
{"sheet":"18","index":21,"n_rows":35,"n_cols":14,"rows_kept":35,"cut":false,"hidden":false,"merged":[[0,9,0,11],[8,2,8,5],[9,2,9,5],[3,1,4,1],[3,2,4,5],[5,2,5,5],[6,2,6,5],[7,2,7,5]]}
[18,"Incomplete",null,null,null,null,null,null,null,"Navigator",null,null,null,"Solution"]
[]
["Points","A homogeneous group of property risks exhibit the following risk profile:"]
[{"$f":"INDEX('Point Grid'!B:B,MATCH('18'!A1,'Point Grid'!A:A,0))","v":3.25},"Exposure Distribution","Losses as a percent of the Maximum Possible Loss (MPL)"]
[]
[null,0.8,0]
[null,0.06,0.25]
[null,0.08,0.5]
[null,0.04,0.75]
[null,0.02,1]
[]
["(a)","Plot the exposure curve, G(x). Label the axes and the points on the curve."]
[{"$f":"INDEX('Point Grid'!$C$8:$I$29,MATCH($A$1,'Point Grid'!$A$8:$A$29,0),MATCH(A12,'Point Grid'!$C$7:$I$7,0))","v":2}]
[]
[]
{"$rows_left_out":21}
{"sheet":"19","index":22,"n_rows":28,"n_cols":10,"rows_kept":28,"cut":false,"hidden":false,"merged":[[0,6,0,7],[10,6,11,6],[10,2,11,2],[10,1,11,1],[10,3,11,3],[10,4,11,4],[10,5,11,5]]}
[19,"Incomplete",null,null,null,null,"Navigator",null,null,"Solution"]
[]
["Points","A primary insurer wants to institute a swing plan with the following terms:"]
[{"$f":"INDEX('Point Grid'!B:B,MATCH('19'!A1,'Point Grid'!A:A,0))","v":3},"   • Layer: $500,000 xs $500,000 per claim"]
[null,"   • Premium = Layer Losses * 1.3"]
[null,"   •  Minimum Premium = $100,000"]
[null,"   • Maximum Premium = $325,000"]
[]
[null,"The reinsurer has analyzed the insurer's experience. All claims are closed and trend has"]
[null,"been applied."]
[null,"Accident Year","On-Level Premium","Claim #1","Claim #2","Claim #3","Claim #4"]
[]
[null,2012,400000,465899,230567,512017]
[null,2013,420000,240785,125766,80154,470666]
[null,2014,1200000,704895,106528]
{"$rows_left_out":14}
{"sheet":"20","index":23,"n_rows":35,"n_cols":9,"rows_kept":35,"cut":false,"hidden":false,"merged":[[0,5,0,6]]}
[20,"Incomplete",null,null,null,"Navigator",null,null,"Solution"]
[]
["Points","An earthquake model produces the following damage function for a $1,000,000 home in"]
[{"$f":"INDEX('Point Grid'!B:B,MATCH('20'!A1,'Point Grid'!A:A,0))","v":2.5},"California:"]
[]
[]
[]
[]
[]
[]
[]
[]
[]
[]
[]
{"$rows_left_out":20}