{"text_format":"1","workbook":"xlsx","n_sheets":21,"sheets":["Instructions","Formula Sheet","Point Grid","Navigator","1","2","3","4","5","6","7","8","9","10","11","12","13","14","15","16","17"],"not_rendered":{"charts":0,"images":2,"macros":1,"external_links":0,"defined_names":0,"comments":0,"pivot_tables":0},"unopened":[],"bounds":{"document_bytes":16777216,"sheet_cells":100000,"rows_first":2000,"rows_last":500,"rows_between":2000,"halvings":0,"cell_chars":16384,"cell_head_chars":4096},"cells_cut":0,"cells_raw":0,"read":"whole","date_system":"1900"}

{"sheet":"Instructions","index":0,"n_rows":32,"n_cols":1,"rows_kept":32,"cut":false,"hidden":false,"merged":[]}
[]
[]
[]
[]
[]
["Instructions"]
[]
["1.) Find a quiet place and allow yourself the full four hour exam period to practice. Treat this just as you would the real exam."]
{"$rows_left_out":25}
{"sheet":"Formula Sheet","index":1,"n_rows":27,"n_cols":2,"rows_kept":27,"cut":false,"hidden":true,"merged":[]}
[]
[]
[]
[]
[]
["FORMULA SHEET"]
[]
["• For the negative binomial distribution (for use on question 3):"]
{"$rows_left_out":20}
{"sheet":"Point Grid","index":2,"n_rows":28,"n_cols":19,"rows_kept":28,"cut":false,"hidden":false,"merged":[[5,1,6,1]]}
[]
[]
[]
[]
["2018 Exam 8"]
[null,"Total Point Value","Sub-Part of Question",null,null,null,null,null,null,null,null,"Your Score","Sub-Part of Question"]
["Question",null,"(a)","(b)","(c)","(d)","(e)","(f)","(g)","Status",null,"Question","(a)","(b)","(c)","(d)","(e)","(f)","(g)"]
[1,{"$f":"SUM(C8:I8)","v":9},1.5,1.5,2.25,1.5,1,0.5,0.75,{"$f":"INDIRECT(\"'\"&A8&\"'!B1\")","v":"Finished"},null,{"$f":"A8","v":1},{"$f":"_xlfn.IFNA(IF(ISBLANK(INDEX(INDIRECT(\"'\"&$L8&\"'!$A:$A\"),MATCH(M$7,INDIRECT(\"'\"&$L8&\"'!$A:$A\"),0)+2)),\"\",INDEX(INDIRECT(\"'\"&$L8&\"'!$A:$A\"),MATCH(M$7,INDIRECT(\"'\"&$L8&\"'!$A:$A\"),0)+2)),\"\")","v":1.5},1.5,2.25,1.5,1,0.5,0.75]
{"$rows_left_out":21}
{"sheet":"Navigator","index":3,"n_rows":25,"n_cols":8,"rows_kept":25,"cut":false,"hidden":false,"merged":[[19,0,19,6],[8,0,8,6],[9,0,9,6],[10,0,10,6],[11,0,11,6],[12,0,12,6],[13,0,13,6],[14,0,14,6],[15,0,15,6],[16,0,16,6],[17,0,17,6],[18,0,18,6],[20,0,20,6],[21,0,21,6],[22,0,22,6],[23,0,23,6],[24,0,24,6]]}
[]
[]
[]
[]
[]
["Navigator – Select a question to go to it"]
[]
["Question #",null,null,null,null,null,null,"Status"]
{"$rows_left_out":18}
{"sheet":"1","index":4,"n_rows":113,"n_cols":17,"rows_kept":113,"cut":false,"hidden":false,"merged":[[54,2,55,2],[0,7,0,8]]}
[1,"Finished",null,null,null,null,null,"Navigator",null,null,"Solution"]
[null,null,null,null,null,null,null,null,null,"(a)","Notice we're given claim counts rather than claim frequencies. Also, LOB 1"]
["Points","An insurance company is planning to expand into a new territory and has decided to review its historical",null,null,null,null,null,null,null,null,"has increasing premiums and claim counts. So we'll need to convert to claim"]
[{"$f":"INDEX('Point Grid'!B:B,MATCH('1'!A1,'Point Grid'!A:A,0))","v":9},"loss experience in order to determine whether it will require additional capital to support the expansion.",null,null,null,null,null,null,null,null,"frequencies before we can address the question."]
[]
[null,"The insurance company has engaged an actuarial consultant to provide insights into a prospective loss ratio ",null,null,null,null,null,null,null,null,"We are given 5 periods for each line of business and need to estimate the"]
[null,"for the new territory. The following table outlines the insurance company's historical experience for two",null,null,null,null,null,null,null,null,"overall claim frequency for each. Therefore we have 5 - 1 = 4 degrees of freedom,"]
[null,"long-tailed lines of business (LOB):",null,null,null,null,null,null,null,null,"So the critical value (using the table given) is 7.779"]
{"$rows_left_out":106}
{"sheet":"2","index":5,"n_rows":90,"n_cols":18,"rows_kept":90,"cut":false,"hidden":false,"merged":[[0,10,0,11]]}
[2,"Finished",null,null,null,null,null,null,null,null,"Navigator",null,null,"Solution"]
[null,null,null,null,null,null,null,null,null,null,null,null,"(a)","E[N] =",{"$f":"SUMPRODUCT(C13:C15,D13:D15)","v":0.25}]
["Points","A certain golf course holds a series of tournaments throughout the year, during which prizes are awarded if a player hits a ",null,null,null,null,null,null,null,null,null,null,null,"E[X] =",{"$f":"SUMPRODUCT(C20:C23,D20:D23)","v":257500}]
[{"$f":"INDEX('Point Grid'!B:B,MATCH('2'!A1,'Point Grid'!A:A,0))","v":9.5},"hole-in-one. The prize amounts vary based on the difficulty of the hole, but are consistent across tournaments.",null,null,null,null,null,null,null,null,null,null,null,"E[S] = E[N] * E[X] =",null,{"$f":"O3*O2","v":64375}]
[null,null,null,null,null,null,null,null,null,null,null,null,null,"This is the loss cost. Now load for expenses."]
[null,"The course has approached an insurer to design a policy which would protect the course from large prize payouts.",null,null,null,null,null,null,null,null,null,null,null,"Expense multiplier = 1/(1 - general expense - commission - taxes - underwriting)"]
[null,"The insurer would pay the full prize amount directly to the winning player, and seek recoveries of any applicable ",null,null,null,null,null,null,null,null,null,null,null,{"$f":"1/(1-D27-D28-D29-D30)","v":1.3888888888888888}]
[null,"deductible from the golf course."]
{"$rows_left_out":83}
{"sheet":"3","index":6,"n_rows":38,"n_cols":13,"rows_kept":38,"cut":false,"hidden":false,"merged":[[4,2,6,2],[4,1,6,1],[4,3,6,3],[4,4,6,4],[4,5,6,5]]}
[3,"Finished",null,null,null,null,null,"Navigator",null,"Solution"]
[null,null,null,null,null,null,null,null,"(a)","Mod = Z*R + (1 - Z)*1"]
["Points","An insurance company has a private passenger auto book of business with the following",null,null,null,null,null,null,null,"Here, Z = 0.038 and we know insureds in Group B have at least 1 claim."]
[{"$f":"INDEX('Point Grid'!B:B,MATCH('3'!A1,'Point Grid'!A:A,0))","v":2.75},"claims experience:",null,null,null,null,null,null,null,"P(at least 1 claim) = 1 - e-λ"]
[null,"Group","Number of Accident-Free Years","Earned Premiums","Current Merit Rating Factor","Number of Claims Incurred",null,null,null,"R = 1/P(at least 1 claim) = ",null,null,{"$f":"1/(1-EXP(-1*0.05))","v":20.504166493065892}]
[]
[null,null,null,null,null,null,null,null,null,"Hence Mod =",null,{"$f":"0.038*M5+(1-0.038)*1","v":1.7411583267365038}]
[null,"A","3 or more",216000000,0.6,25000,null,null,null,"Since the current merit rating factor is given and we know we need the earned premiums to be"]
{"$rows_left_out":31}
{"sheet":"4","index":7,"n_rows":15,"n_cols":9,"rows_kept":15,"cut":false,"hidden":false,"merged":[]}
[4,"Finished",null,null,null,null,"Navigator",null,"Solution"]
[null,null,null,null,null,null,null,"(a)","Risk of adverse selection"]
["Points","An insurance company is launching a new telematics program for their private passenger",null,null,null,null,null,null,"There is a low risk of adverse selection as drivers who know they are bad drivers are"]
[{"$f":"INDEX('Point Grid'!B:B,MATCH('4'!A1,'Point Grid'!A:A,0))","v":0.75},"automobile book of business. Telematics devices record various attributes such as miles",null,null,null,null,null,null,"unlikely to join the program because they would receive higher rates. This supports offering a discount."]
[null,"driven and braking practices. Management decided to give a 5% discount to all customers"]
[null,"that participate in the program. The Department of Insurance questions the filing and ",null,null,null,null,null,null,"Relationship between risk and expected outcomes"]
[null,"wants the company to address the following potential concerns:",null,null,null,null,null,null,"Since drivers are likely to engage in less risky behavior if they know they are being monitored,"]
[null,null,null,null,null,null,null,null,"the loss experience should be lower for the telematics program than a traditional program. "]
{"$rows_left_out":8}
{"sheet":"5","index":8,"n_rows":28,"n_cols":9,"rows_kept":28,"cut":false,"hidden":false,"merged":[]}
[5,"Finished",null,null,null,null,"Navigator",null,"Solution"]
[null,null,null,null,null,null,null,"(a)","Bin the Variable: We could create categorical variables by grouping together ages that have"]
["Points","An actuary is analyzing a partial residual plot of the driver age variable, which is shown below.",null,null,null,null,null,null,"similar residuals. For instance creating groups for \"15-25\", \"26-80\" and \"81+\" captures the broad"]
[{"$f":"INDEX('Point Grid'!B:B,MATCH('5'!A1,'Point Grid'!A:A,0))","v":1.5},null,null,null,null,null,null,null,"pattern of the residuals without the individual variability."]
[]
[null,null,null,null,null,null,null,null,"Piecewise Linear Functions: We could use hinge functions to fit piecewise linear functions to the residuals."]
[null,null,null,null,null,null,null,null,"This captures the different slopes of the residuals and allows for interpolation to give greater"]
[null,null,null,null,null,null,null,null,"rating refinement. In this case we can use hinge points at 25 and 75 years old."]
{"$rows_left_out":21}
{"sheet":"6","index":9,"n_rows":26,"n_cols":11,"rows_kept":26,"cut":false,"hidden":false,"merged":[[6,1,6,2],[7,1,7,2]]}
[6,"Finished",null,null,null,null,"Navigator",null,"Solution"]
[null,null,null,null,null,null,null,"(a)","F-Test","The F-statistic is"]
["Points","An actuary is comparing the output of two generalized linear models to develop a new "]
[{"$f":"INDEX('Point Grid'!B:B,MATCH('6'!A1,'Point Grid'!A:A,0))","v":2.5},"rating plan for personal auto. Model statistics are shown below:",null,null,null,null,null,null,null,"is the estimated dispersion parameter for the larger model (model B)"]
[null,null,null,"Model",null,null,null,null,"D denotes the deviance of the model and is given by D = 2*(llsat - llmodel)"]
[null,null,null,"Saturated","A","B",null,null,"where ll stands for log-likelihood."]
[null,"Log-Likelihood",null,-1000,-1500,-1465]
[null,"Estimated Dispersion Parameter",null,1.75,1.75,1.75,null,null,"Model B adds the Driver Age variable which is a 2nd order polynomial. This adds 2 parameters"]
{"$rows_left_out":19}
{"sheet":"7","index":10,"n_rows":43,"n_cols":15,"rows_kept":43,"cut":false,"hidden":false,"merged":[[0,6,0,7]]}
[7,"Finished",null,null,null,null,"Navigator",null,null,"Solution"]
[null,null,null,null,null,null,null,null,"(a)","Policy 1","ln( 1.3% / [1 - 1.3%]) =",null,{"$f":"LN(C17/(1-C17))","v":-4.3297206819719447}]
["Points","An actuary is planning to add a credit-based insurance score to a model that estimates the ",null,null,null,null,null,null,null,"Policy 2","ln( 20.3% / [1 - 20.3%]) =",null,{"$f":"LN(C18/(1-C18))","v":-1.3676486997484274}]
[{"$f":"INDEX('Point Grid'!B:B,MATCH('7'!A1,'Point Grid'!A:A,0))","v":2.5},"probability of a policy having a claim. The actuary has decided to offset all of the current model ",null,null,null,null,null,null,null,"Policy 3","ln( 2.5% / [1 - 2.5%]) =",null,-3.6635616461296463]
[null,"variables before fitting the new variable."]
[null,null,null,null,null,null,null,null,"(b)"]
[null,"Given the following:"]
[null,"   • The current model (without the insurance score variable) is a logit-link binomial GLM",null,null,null,null,null,null,null,"Policy 1","ln( u / [1 -  u]) = -0.02 * 78 + 1.25 + -4.330 =",null,null,null,{"$f":"C23*D17+C22+M2","v":-4.6397206819719443}]
{"$rows_left_out":36}
{"sheet":"8","index":11,"n_rows":11,"n_cols":9,"rows_kept":11,"cut":false,"hidden":false,"merged":[]}
[8,"Finished",null,null,null,null,"Navigator",null,"Solution"]
[null,null,null,null,null,null,null,"(a)","The risk adjusted ILFs are more accurate as they explicitly calculate how the risk load"]
["Points","An actuary has been using risk-adjusted increased limit factors to account for riskiness in pricing.",null,null,null,null,null,null,"varies as the limits increase. Varying the profit requires more judgment and so"]
[{"$f":"INDEX('Point Grid'!B:B,MATCH('8'!A1,'Point Grid'!A:A,0))","v":1.5},"The actuary's coworker has suggested an alternate approach of using non-risk-adjusted",null,null,null,null,null,null,"cannot be guaranteed to be accurate."]
[null,"increased limit factors and, instead, varying the profit and contingency load with the "]
[null,"policy limit.",null,null,null,null,null,null,"The risk adjusted ILFs are an involved calculation which must be calibrated to the portfolio. "]
[null,null,null,null,null,null,null,null,"It would be easier to vary the profit and contingency loads."]
["(a)","Compare and contrast the two methods with respect to each of the following:"]
{"$rows_left_out":4}
{"sheet":"9","index":12,"n_rows":30,"n_cols":23,"rows_kept":30,"cut":false,"hidden":false,"merged":[[14,9,15,9],[7,1,8,1],[7,3,8,3],[7,4,8,4],[7,7,8,7],[14,8,15,8]]}
[9,"Finished",null,null,null,null,null,null,null,null,"Navigator",null,"Solution",null,null,null,null,null,"Manual ",null,"Standard","Manual","Standard"]
[null,null,null,null,null,null,null,null,null,null,null,"(a)","Risk","Rank",null,"Quintile","Risk A","Risk B","Premium","Loss","Premium","Loss Ratio","Loss Ratio"]
["Points","Three insurers are using experience rating to determine premiums for a specific class of business. The",null,null,null,null,null,null,null,null,null,null,1,{"$f":"_xlfn.RANK.AVG(E10,$E$10:$E$19,1)","v":8},null,1,{"$f":"INDEX($M$3:$M$12,MATCH(1,$N$3:$N$12,0))","v":2},{"$f":"INDEX($M$3:$M$12,MATCH(2,$N$3:$N$12,0))","v":8},{"$f":"SUMIFS($C$10:$C$19,$B$10:$B$19,Q3)+SUMIFS($C$10:$C$19,$B$10:$B$19,R3)","v":2200},{"$f":"SUMIFS($D$10:$D$19,$B$10:$B$19,Q3)+SUMIFS($D$10:$D$19,$B$10:$B$19,R3)","v":1290},{"$f":"SUMIFS($F$10:$F$19,$B$10:$B$19,Q3)+SUMIFS($F$10:$F$19,$B$10:$B$19,R3)","v":1548},{"$f":"T3/S3","v":0.58636363636363631},{"$f":"T3/U3","v":0.83333333333333337}]
[{"$f":"INDEX('Point Grid'!B:B,MATCH('9'!A1,'Point Grid'!A:A,0))","v":4.25},"same ten risks were rated using the experience plan of each insurer. Information related to each rating",null,null,null,null,null,null,null,null,null,null,2,{"$f":"_xlfn.RANK.AVG(E11,$E$10:$E$19,1)","v":1},null,2,{"$f":"INDEX($M$3:$M$12,MATCH(3,$N$3:$N$12,0))","v":10},{"$f":"INDEX($M$3:$M$12,MATCH(4,$N$3:$N$12,0))","v":4},{"$f":"SUMIFS($C$10:$C$19,$B$10:$B$19,Q4)+SUMIFS($C$10:$C$19,$B$10:$B$19,R4)","v":2475},{"$f":"SUMIFS($D$10:$D$19,$B$10:$B$19,Q4)+SUMIFS($D$10:$D$19,$B$10:$B$19,R4)","v":1625},{"$f":"SUMIFS($F$10:$F$19,$B$10:$B$19,Q4)+SUMIFS($F$10:$F$19,$B$10:$B$19,R4)","v":1901},{"$f":"T4/S4","v":0.65656565656565657},{"$f":"T4/U4","v":0.85481325618095738}]
[null,"plan is given below:",null,null,null,null,null,null,null,null,null,null,3,10,null,3,{"$f":"INDEX($M$3:$M$12,MATCH(5,$N$3:$N$12,0))","v":5},{"$f":"INDEX($M$3:$M$12,MATCH(6,$N$3:$N$12,0))","v":9},2525,2025,{"$f":"SUMIFS($F$10:$F$19,$B$10:$B$19,Q5)+SUMIFS($F$10:$F$19,$B$10:$B$19,R5)","v":2251},{"$f":"T5/S5","v":0.80198019801980203},0.89960017769880052]
[null,null,null,null,null,null,null,null,null,null,null,null,4,4,null,4,{"$f":"INDEX($M$3:$M$12,MATCH(7,$N$3:$N$12,0))","v":6},{"$f":"INDEX($M$3:$M$12,MATCH(8,$N$3:$N$12,0))","v":1},1910,1750,{"$f":"SUMIFS($F$10:$F$19,$B$10:$B$19,Q6)+SUMIFS($F$10:$F$19,$B$10:$B$19,R6)","v":1842},{"$f":"T6/S6","v":0.91623036649214662},0.95005428881650378]
[null,"Insurer 1's Plan",null,null,null,null,null,"Insurer 2's Plan",null,null,null,null,5,5,null,5,{"$f":"INDEX($M$3:$M$12,MATCH(9,$N$3:$N$12,0))","v":7},{"$f":"INDEX($M$3:$M$12,MATCH(10,$N$3:$N$12,0))","v":3},2175,2375,{"$f":"SUMIFS($F$10:$F$19,$B$10:$B$19,Q7)+SUMIFS($F$10:$F$19,$B$10:$B$19,R7)","v":2373},{"$f":"T7/S7","v":1.0919540229885059},1.0008428150021071]
[null,"Risk #","Manual","Loss","Mod","Standard",null,"Quintile","Manual","Standard",null,null,6,7]
{"$rows_left_out":23}
{"sheet":"10","index":13,"n_rows":38,"n_cols":16,"rows_kept":38,"cut":false,"hidden":false,"merged":[[0,7,0,8],[7,14,9,14],[7,15,9,15],[24,4,25,4],[7,10,9,10],[7,11,9,11],[7,12,9,12],[7,13,9,13]]}
[10,"Finished",null,null,null,null,null,"Navigator",null,null,"Solution"]
[null,null,null,null,null,null,null,null,null,"(a)","Do not use policy year 2018 as this year is incomplete. Assume the LDFs are policy year LDFs."]
["Points","An actuary is analyzing an experience rating plan using three years of experience that has the"]
[{"$f":"INDEX('Point Grid'!B:B,MATCH('10'!A1,'Point Grid'!A:A,0))","v":2.25},"following information:",null,null,null,null,null,null,null,null,"Excess ratio:"]
[]
[null,"Policy effective date",null,null,"2019-01-01",null,null,null,null,null,"k = ",{"$f":"(F30-F27)/F30","v":0.79533121257485029}]
[null,"Policy term",null,null,"One Year"]
[null,"Annual loss trend",null,null,0.02,null,null,null,null,null,"Year","Expected Ultimate Unlimited Loss","% Limited","Loss Trend","LDF","Expected Ultimate Limited Loss"]
{"$rows_left_out":31}
{"sheet":"11","index":14,"n_rows":28,"n_cols":10,"rows_kept":28,"cut":false,"hidden":false,"merged":[]}
[11,"Finished",null,null,null,null,"Navigator",null,"Solution"]
[null,null,null,null,null,null,null,"(a)"]
["Points","Given the following information for a construction insured's general liability policy that is"]
[{"$f":"INDEX('Point Grid'!B:B,MATCH('11'!A1,'Point Grid'!A:A,0))","v":1.25},"subject to the ISO Commercial General Liability Experience and Schedule Rating Plan:",null,null,null,null,null,null,"Lookup EER, Z and MSL based on CSLC value given"]
[null,null,null,null,null,null,null,null,"EER",{"$f":"D19","v":0.92900000000000005}]
[null,"Company Subject Loss Cost",null,270500,null,null,null,null,"Z",{"$f":"C19","v":0.48}]
[null,"Actual Experience Ratio",null,0.85,null,null,null,null,"MSL",{"$f":"E19","v":151450}]
[null,"Policy Effective Date",null,"2020-01-01"]
{"$rows_left_out":21}
{"sheet":"12","index":15,"n_rows":34,"n_cols":10,"rows_kept":34,"cut":false,"hidden":false,"merged":[]}
[12,"Finished",null,null,null,null,"Navigator",null,"Solution"]
[null,null,null,null,null,null,null,"(a)","Incurred Loss Retro"]
["Points","An insured is considering an incurred loss retrospective rating plan and a paid loss deductible plan",null,null,null,null,null,null,"Per-occurrence limit and maximum ratable loss implies an aggregate limit is also present."]
[{"$f":"INDEX('Point Grid'!B:B,MATCH('12'!A1,'Point Grid'!A:A,0))","v":3},"with the following characteristics:",null,null,null,null,null,null,"Cost = [(Expected Excess Loss paid by insurer + Primary loss paid by insured)*(1+LAE%) + fixed expense]*(1 + tax rate%)"]
[null,null,null,null,null,null,null,null,"          = [(Expected Ultimate Loss)*(1+LAE%) + fixed expense]*(tax multiplier)"]
[null,"Incurred Loss Retro",null,null,null,null,null,null,{"$f":"(F15*(1+F21)+F19)*F22","v":603580}]
[null,"Per-Occurrence Limit",null,null,null,150000]
[null,"Maximum Ratable Loss",null,null,null,500000,null,null,"Paid Loss Deductible"]
{"$rows_left_out":27}
{"sheet":"13","index":16,"n_rows":25,"n_cols":14,"rows_kept":25,"cut":false,"hidden":false,"merged":[]}
[13,"Finished",null,null,null,null,"Navigator",null,"Solution"]
[null,null,null,null,null,null,null,"(a)","P(X > 10,000) = 1 - F(10,000)",null,null,null,null,{"$f":"(6000/(10000+6000))^2","v":0.140625}]
["Points","An insurance company observes the following ground-up claim experience for a book of business:"]
[{"$f":"INDEX('Point Grid'!B:B,MATCH('13'!A1,'Point Grid'!A:A,0))","v":2.75},"   • Claim counts (N) follow a Poisson distribution with λ = 5,000",null,null,null,null,null,null,"E[N > $10,000] = E[N] * P(X > 10,000) =",null,null,null,{"$f":"5000*N2","v":703.125},"claims in excess of $10,000."]
[null,"   • Claim size (X) follows a Pareto distribution with α = 2 and β = 6,000",null,null,null,null,null,null,"Using N has a Poisson distribution with mean 5,000."]
[]
[null,"The insurance company pays claims in excess of $10,000.",null,null,null,null,null,"(b)","Initial expected excess loss, E[S] = E[N] * (E[X] - E[X; 10,000])"]
[null,null,null,null,null,null,null,null,"E[X] =",{"$f":"6000/(2-1)","v":6000}]
{"$rows_left_out":18}
{"sheet":"14","index":17,"n_rows":43,"n_cols":14,"rows_kept":43,"cut":false,"hidden":false,"merged":[]}
[14,"Finished",null,null,null,null,"Navigator",null,"Solution"]
[null,null,null,null,null,null,null,"(a)","R = (B + c(E - I))*T"]
["Points","The balanced plan provision for a workers' compensation risk in the state of Alabama are given below:",null,null,null,null,null,null,"B is the basic premium, c is the loss conversion factor, E is the expected loss,"]
[{"$f":"INDEX('Point Grid'!B:B,MATCH('14'!A1,'Point Grid'!A:A,0))","v":3},"Standard Premium",null,9000000,null,null,null,null,"I is the net insurance charge and T is the tax multiplier."]
[null,"Minimum Entry Ratio, rH",null,0.28000000000000003]
[null,"Maximum Entry Ratio, rG",null,2.5499999999999998,null,null,null,null,"E = Adjusted Expected Loss / State Hazard Group Differential"]
[null,"ϕ(rG)",null,3.7900000000000003E-2,null,null,null,null,"E = ",{"$f":"D12/D11","v":5400000}]
[null,"ϕ(rH)",null,0.72529999999999994]
{"$rows_left_out":36}
{"sheet":"15","index":18,"n_rows":25,"n_cols":14,"rows_kept":25,"cut":false,"hidden":false,"merged":[[12,1,14,1],[0,6,0,7]]}
[15,"Finished",null,null,null,null,"Navigator",null,null,"Solution"]
[null,null,null,null,null,null,null,null,"(a)","Expected loss ratio before loss corridor",null,null,null,{"$f":"SUMPRODUCT(C16:C19,D16:D19)","v":0.67777000000000009}]
["Points","A reinsurer has priced a quota share treaty to achieve an expected combined ratio of 90%."]
[{"$f":"INDEX('Point Grid'!B:B,MATCH('15'!A1,'Point Grid'!A:A,0))","v":1.75},"Expenses for the treaty are as follows:",null,null,null,null,null,null,null,"Combined Ratio = loss ratio + ceding commission + fees + expenses"]
[null,null,null,null,null,null,null,null,null,"Therefore, loss ratio (with loss corridor) =",null,null,null,{"$f":"90%-C6-C7-C8-C9","v":0.62999999999999989}]
[null,"Ceding Commission",0.2,null,null,null,null,null,null,"This is the reinsurer's loss ratio with the loss corridor"]
[null,"Brokerage Fees",0.05]
[null,"Administrative Expenses",0.01,null,null,null,null,null,null,"Let x% be the percent reassumed by the primary insurer."]
{"$rows_left_out":18}
{"sheet":"16","index":19,"n_rows":33,"n_cols":13,"rows_kept":33,"cut":false,"hidden":false,"merged":[[0,5,0,6]]}
[16,"Finished",null,null,null,"Navigator",null,null,"Solution"]
[null,null,null,null,null,null,null,"(a)","Use linear interpolation between the exceedance probabilities for the 200 and 500 year return periods."]
["Points","A reinsurance company is evaluating whether or not to write a $50 million excess of"]
[{"$f":"INDEX('Point Grid'!B:B,MATCH('16'!A1,'Point Grid'!A:A,0))","v":1.75},"$50 million catastrophe reinsurance contract with a primary insurer. The reinsurer is",null,null,null,null,null,null,"The primary insurer keeps the first $50million of catastrophe losses and any excess over the layer [50m, 100m]"]
[null,"currently holding $850 million of capital and is required to hold enough capital to survive",null,null,null,null,null,null,"($000,000)"]
[null,"a 1-in-250 event. Without the new contract, the reinsurance company has a 1-in-250",null,null,null,null,null,null,"Return","Exceedance","Gross","Ceded","Net"]
[null,"probable maximum loss (PML) of $825 million which is solely driven by the ",null,null,null,null,null,null,"Period","Probability","PML","PML","PML"]
[null,"hurricane peril.",null,null,null,null,null,null,500,{"$f":"1/I8","v":2E-3},{"$f":"C16","v":105},50,{"$f":"K8-L8","v":55}]
{"$rows_left_out":26}
{"sheet":"17","index":20,"n_rows":19,"n_cols":9,"rows_kept":19,"cut":false,"hidden":false,"merged":[[0,5,0,6]]}
[17,"Finished",null,null,null,"Navigator",null,null,"Solution"]
[null,null,null,null,null,null,null,"(a)","The Vulnerability module needs to be modified because it quantifies the physical damage to exposed properties."]
["Points","A catastrophe modeler would like to incorporate a new construction technique into a ",null,null,null,null,null,null,"The Inventory module needs to be updated because it describes the property exposures."]
[{"$f":"INDEX('Point Grid'!B:B,MATCH('17'!A1,'Point Grid'!A:A,0))","v":2},"catastrophe model. This new technique would theoretically reduce the amount of building"]
[null,"damage sustained during hurricane force winds. However, experts have not reached a ",null,null,null,null,null,"(b)","The uncertainty due to the new construction technique is epistemic."]
[null,"consensus on the effectiveness of the new construction technique because it has not been",null,null,null,null,null,null,"This is because we may not know enough about the technique and there is no historical"]
[null,"exposed to an actual hurricane.",null,null,null,null,null,null,"data available. This causes the uncertainty rather than inherent randomness in the process."]
[]
{"$rows_left_out":11}