{"text_format":"1","workbook":"xlsx","n_sheets":23,"sheets":["Instructions","Formula Sheet","Point Grid","Navigator","1","2","3","4","5","6","7","8","9","10","11","12","13","14","15","16","17","18","19"],"not_rendered":{"charts":2,"images":10,"macros":1,"external_links":0,"defined_names":0,"comments":0,"pivot_tables":0},"unopened":[],"bounds":{"document_bytes":16777216,"sheet_cells":100000,"rows_first":2000,"rows_last":500,"rows_between":2000,"halvings":0,"cell_chars":16384,"cell_head_chars":4096},"cells_cut":0,"cells_raw":0,"read":"whole","date_system":"1900"}

{"sheet":"Instructions","index":0,"n_rows":32,"n_cols":1,"rows_kept":32,"cut":false,"hidden":false,"merged":[]}
[]
[]
[]
[]
[]
["Instructions"]
[]
["1.) Find a quiet place and allow yourself the full four hour exam period to practice. Treat this just as you would the real exam."]
{"$rows_left_out":25}
{"sheet":"Formula Sheet","index":1,"n_rows":27,"n_cols":2,"rows_kept":27,"cut":false,"hidden":false,"merged":[]}
[]
[]
[]
[]
[]
["FORMULA SHEET"]
[]
["• For the negative binomial distribution (for use on question 3):"]
{"$rows_left_out":20}
{"sheet":"Point Grid","index":2,"n_rows":30,"n_cols":19,"rows_kept":30,"cut":false,"hidden":false,"merged":[[5,1,6,1]]}
[]
[]
[]
[]
["2019 Exam 8"]
[null,"Total Point Value","Sub-Part of Question",null,null,null,null,null,null,null,null,"Your Score","Sub-Part of Question"]
["Question",null,"(a)","(b)","(c)","(d)","(e)","(f)","(g)","Status",null,"Question","(a)","(b)","(c)","(d)","(e)","(f)","(g)"]
[1,{"$f":"SUM(C8:I8)","v":2.25},1.5,0.75,null,null,null,null,null,{"$f":"INDIRECT(\"'\"&A8&\"'!B1\")","v":"Finished"},null,{"$f":"A8","v":1},{"$f":"_xlfn.IFNA(IF(ISBLANK(INDEX(INDIRECT(\"'\"&$L8&\"'!$A:$A\"),MATCH(M$7,INDIRECT(\"'\"&$L8&\"'!$A:$A\"),0)+2)),\"\",INDEX(INDIRECT(\"'\"&$L8&\"'!$A:$A\"),MATCH(M$7,INDIRECT(\"'\"&$L8&\"'!$A:$A\"),0)+2)),\"\")","v":1.5},0.75,"","","","",""]
{"$rows_left_out":23}
{"sheet":"Navigator","index":3,"n_rows":27,"n_cols":8,"rows_kept":27,"cut":false,"hidden":false,"merged":[[26,0,26,6],[20,0,20,6],[21,0,21,6],[22,0,22,6],[23,0,23,6],[24,0,24,6],[25,0,25,6],[19,0,19,6],[8,0,8,6],[9,0,9,6],[10,0,10,6],[11,0,11,6],[12,0,12,6],[13,0,13,6],[14,0,14,6],[15,0,15,6],[16,0,16,6],[17,0,17,6],[18,0,18,6]]}
[]
[]
[]
[]
[]
["Navigator – Select a question to go to it"]
[]
["Question #",null,null,null,null,null,null,"Status"]
{"$rows_left_out":20}
{"sheet":"1","index":4,"n_rows":29,"n_cols":13,"rows_kept":29,"cut":false,"hidden":false,"merged":[[17,3,17,4],[17,5,17,6],[19,3,19,4],[20,3,20,4],[21,3,21,4],[19,5,19,6],[20,5,20,6],[21,5,21,6]]}
[1,"Finished",null,null,null,null,null,"Navigator",null,"Solution"]
[null,null,null,null,null,null,null,null,"(a)","Multi-Dimensional Credibility Formula"]
["Points","An insurer uses five geographical Storm Zones (A, B, C, D, and E) in their rating plan."]
[{"$f":"INDEX('Point Grid'!B:B,MATCH('1'!A1,'Point Grid'!A:A,0))","v":2.25},"The insurer refines their rating plan using the following approach:"]
[null,"• Divide each Storm Zone into numerous geographical sectors.",null,null,null,null,null,null,null,"Here, a subscript S refers to the storm sector which is analogous to the class within a "]
[null,"• For each geographical sector and storm type, calculate the observed storm frequency",null,null,null,null,null,null,null,"hazard group. A subscript Z refers to the storm zone which plays the role of a hazard group."]
[null,"   as number of storms per year."]
[null,"   ○ There are three storm types defined as Moderate, Strong, and Severe storms.",null,null,null,null,null,null,null,"Let V represent severe storms, W strong storms, and X moderate storms. These take on the"]
{"$rows_left_out":22}
{"sheet":"2","index":5,"n_rows":51,"n_cols":15,"rows_kept":51,"cut":false,"hidden":false,"merged":[[0,10,0,11]]}
[2,"Finished",null,null,null,null,null,null,null,null,"Navigator",null,null,"Solution"]
[null,null,null,null,null,null,null,null,null,null,null,null,"(a)","Sort the data by modeled loss cost in ascending order."]
["Points","An actuary has built two generalized linear models to predict loss costs. Management has requested a series of model validation",null,null,null,null,null,null,null,null,null,null,null,"Note both models have the same order so the plots"]
[{"$f":"INDEX('Point Grid'!B:B,MATCH('2'!A1,'Point Grid'!A:A,0))","v":2.75},"plots to demonstrate the appropriateness of each of the new models. Output for each model, simple quantile plots, and a",null,null,null,null,null,null,null,null,null,null,null,"are identical."]
[null,"double lift plot are shown below:",null,null,null,null,null,null,null,null,null,null,null,"Obs","Actual Loss Ratio"]
[null,null,null,"Observation","Actual Loss Cost","Model A Loss Cost","Model B Loss Cost","Earned Premium",null,null,null,null,null,3,{"$f":"E9/H9","v":0}]
[null,null,null,1,1500,825,900,1800,null,null,null,null,null,2,{"$f":"E8/H8","v":0.46551724137931033}]
[null,null,null,2,675,765,800,1450,null,null,null,null,null,1,{"$f":"E7/H7","v":0.83333333333333337}]
{"$rows_left_out":44}
{"sheet":"3","index":6,"n_rows":22,"n_cols":13,"rows_kept":22,"cut":false,"hidden":false,"merged":[[0,4,0,5]]}
[3,"Finished",null,null,"Formula Sheet",null,null,"Navigator",null,"Solution"]
[null,null,null,null,null,null,null,null,"(a)","Using ",null,null,"yields 0.101 = 10p / (1 - p)"]
["Points","An insurance company has a private passenger auto book of business with an experience"]
[{"$f":"INDEX('Point Grid'!B:B,MATCH('3'!A1,'Point Grid'!A:A,0))","v":1.75},"modification factor in its rating plan.",null,null,null,null,null,null,null,"Solving this for p gives p = 0.01."]
[null,"Given the following:"]
[null,"   • Annual claims for an individual driver follow a negative binomial distribution with ",null,null,null,null,null,null,null,"Next, we need the probability of no claims, Pr(N = 0)"]
[null,"       r = 10."]
[null,"   • The expected claim frequency for the entire book of business is 0.101."]
{"$rows_left_out":15}
{"sheet":"4","index":7,"n_rows":20,"n_cols":13,"rows_kept":20,"cut":false,"hidden":false,"merged":[]}
[4,"Finished",null,null,null,null,"Navigator",null,"Solution"]
[null,null,null,null,null,null,null,null,"Although class 5 looks to be an outlier at both limits, it also has the lowest earned premium"]
["Points","An actuary wants to cluster six workers compensation classes based on excess ratios at",null,null,null,null,null,null,"so more volatility is expected. Recommend the L2 measure as it isn't a sufficient outlier."]
[{"$f":"INDEX('Point Grid'!B:B,MATCH('4'!A1,'Point Grid'!A:A,0))","v":3},"two limits: 750,000 and 1,500,000. The actuary decides to use a weighted k-means",null,null,null,null,null,null,null,"Centroid"]
[null,"algorithm with three clusters. Given the following:",null,null,null,null,null,null,"Cluster",750000,1500000]
[null,"Class","On-Leveled Earned Premium","Normalized Excess Ratio at 750,000 Limit","Normalized Excess Ratio at 1,500,000 Limit","Initial Cluster",null,null,"A",{"$f":"(C7*D7+C10*D10+C11*D11)/(C7+C10+C11)","v":0.26555555555555554},{"$f":"(C7*E7+C10*E10+C11*E11)/(C7+C10+C11)","v":0.11322222222222222}]
[null,1,7000000,0.25,9.5000000000000001E-2,"A",null,null,"B",{"$f":"(C8*D8+C12*D12)/(C8+C12)","v":0.22060606060606061},{"$f":"(C8*E8+C12*E12)/(C8+C12)","v":8.9272727272727267E-2}]
[null,2,8000000,0.2,0.08,"B",null,null,"C",{"$f":"D9","v":0.17},{"$f":"E9","v":6.2E-2}]
{"$rows_left_out":13}
{"sheet":"5","index":8,"n_rows":35,"n_cols":23,"rows_kept":35,"cut":false,"hidden":false,"merged":[]}
[5,"Finished",null,null,null,null,"Navigator",null,"Solution"]
[null,null,null,null,null,null,null,"(a)","The logit link function should be used,",null,null,null,null,"where "]
["Points","The following confusion matrix shows the results from a claim fraud model with a "]
[{"$f":"INDEX('Point Grid'!B:B,MATCH('5'!A1,'Point Grid'!A:A,0))","v":2.75},"discrimination threshold of 25%:",null,null,null,null,null,null,"This is appropriate because the inverse of the logit function is the logistic function,"]
[null,null,"Predicted",null,null,null,null,null,null,null,"which takes any real number and maps it to the interval [0, 1]."]
[null,"Actual","Yes","No",null,null,null,null,null,null,"By choosing a discriminant threshold we can turn this into a "]
[null,"Yes",72,162,null,null,null,null,null,null,"binary outcome."]
[null,"No",63,1203]
{"$rows_left_out":28}
{"sheet":"6","index":9,"n_rows":33,"n_cols":9,"rows_kept":33,"cut":false,"hidden":false,"merged":[]}
[6,"Finished",null,null,null,null,"Navigator",null,"Solution"]
[null,null,null,null,null,null,null,"(a)","Sprinklered property, AOI = 200,000, Occupancy Class 2"]
["Points","An actuary creates a generalized linear model (GLM) to estimate commercial property claim",null,null,null,null,null,null,{"$f":"\"= exp(\"&E14&\" + \"& E15&\" + \"&E18&\" + \"&E19&\" * ln(200,000) + \"&E20&\" * ln(200,000))\"","v":"= exp(-8.4607 + 0.2714 + 0.7228 + 0.4311 * ln(200,000) + -0.096 * ln(200,000))"}]
[{"$f":"INDEX('Point Grid'!B:B,MATCH('6'!A1,'Point Grid'!A:A,0))","v":2},"frequency by occupancy class and amount of insurance (AOI) for sprinklered and",null,null,null,null,null,null,{"$f":"EXP(E14+E15+E18+E19*LN(200000)+E20*LN(200000))","v":3.4175541332503639E-2}]
[null,"non-sprinklered risks. Given the following:"]
[null,"   • Occupancy class is a categorical variable with four levels: Class 1, 2, 3 and 4.",null,null,null,null,null,null,"Non-Sprinklered property, AOI = 200,000, Occupancy Class 2"]
[null,"   • Sprinklered status is a categorical variable with two levels: sprinklered and ",null,null,null,null,null,null,{"$f":"\"= exp(\"&E14&\" + \"& E15&\" + \"&E19&\" * ln(200,000))\"","v":"= exp(-8.4607 + 0.2714 + 0.4311 * ln(200,000))"}]
[null,"      non-sprinklered.",null,null,null,null,null,null,{"$f":"EXP(E14+E15+E19*LN(200000))","v":5.3543435149753148E-2}]
{"$rows_left_out":26}
{"sheet":"7","index":10,"n_rows":84,"n_cols":18,"rows_kept":84,"cut":false,"hidden":false,"merged":[[25,15,26,15],[25,16,26,16],[5,6,5,7],[6,6,6,7],[7,6,7,7],[8,6,8,7],[0,10,0,11],[0,5,0,6],[20,3,20,4],[21,3,21,4],[39,7,39,8],[12,3,12,4],[13,3,13,4],[14,3,14,4],[15,3,15,4],[19,3,19,4]]}
[7,"Finished",null,null,null,"Formula Sheet",null,null,null,null,"Navigator",null,null,"Solution"]
[null,null,null,null,null,null,null,null,null,null,null,null,"(a)","Loss Elimination Ratio (LER) =  E[X; 100,000] / E[X]"]
["Points","An actuary is pricing a workers compensation policy. Given the following:",null,null,null,null,null,null,null,null,null,null,null,"Using the formulas on the Formula Sheet we calculate"]
[{"$f":"INDEX('Point Grid'!B:B,MATCH('7'!A1,'Point Grid'!A:A,0))","v":7.5},null,"Policy Effective Date",null,null,null,"2020-01-01"]
[null,null,"Policy Term",null,null,null,"One year",null,null,null,null,null,null,"LER = ",null,"=",{"$f":"1-(22800/122800)^0.3","v":0.39657827218165509}]
[null,null,"Annual Loss Trend",null,null,null,4.4999999999999998E-2]
[null,null,"Cap for individual claims",null,null,null,100000,null,null,null,null,null,null,"This yields the expected ultimate limited loss before modification"]
[null,null,"Credibility factor",null,null,null,0.4,null,null,null,null,null,null,"as",{"$f":"G9&\" * \"&TEXT(Q5,\"0.0000\")& \" = \"&TEXT(G9*Q5,\"0,000.00\")","v":"1064000 * 0.3966 = 421,959.28"}]
{"$rows_left_out":77}
{"sheet":"8","index":11,"n_rows":20,"n_cols":12,"rows_kept":20,"cut":false,"hidden":false,"merged":[]}
[8,"Finished",null,null,null,null,"Navigator",null,"Solution"]
[null,null,null,null,null,null,null,"(a)","ILF(500,000) = 156,250 / 58,750 =",null,null,{"$f":"D15/D13","v":2.6595744680851063}]
["Points","Given the following for a policy:",null,null,null,null,null,null,"ILF(1,000,000) = 218,750 / 58,750 = ",null,null,{"$f":"D16/D13","v":3.7234042553191489}]
[{"$f":"INDEX('Point Grid'!B:B,MATCH('8'!A1,'Point Grid'!A:A,0))","v":1.5},"   • Basic Limit = 100,000"]
[null,"   • Expected Basic Limit Indemnity = 65,000",null,null,null,null,null,null,"Expected Losses = Expected Basic Limit Indemnity * (ILF (1m) - ILF (500k))"]
[null,"   • Allocated Loss Adjustment Expense (ALAE) = 20% of Indemnity",null,null,null,null,null,null,{"$f":"65000*(L3-L2)","v":69148.936170212764}]
[null,"   • Unallocated Loss Adjustment Expense = 1.5% of Indemnity and ALAE"]
[null,"   • All other expenses are variable and are 15% of the premium",null,null,null,null,null,null,"Premium = [Expected Losses *(1 + ALAE%)*(1 + ULAE%) ] / [1 - Var. Exp. - Profit %]"]
{"$rows_left_out":13}
{"sheet":"9","index":12,"n_rows":16,"n_cols":9,"rows_kept":16,"cut":false,"hidden":false,"merged":[[8,3,9,3],[8,4,9,4],[10,3,11,3],[10,4,11,4],[8,1,9,2],[10,1,11,2]]}
[9,"Finished",null,null,null,null,"Navigator",null,"Solution"]
[null,null,null,null,null,null,null,"(a)","High VHM means there is significant variance between risks within the class, this"]
["Points","An insurer's risk classification system contains four classes (A, B, C, and D). The insurer is considering",null,null,null,null,null,null,"causes the credibility of the experience rating to increase, making experience rating"]
[{"$f":"INDEX('Point Grid'!B:B,MATCH('9'!A1,'Point Grid'!A:A,0))","v":1},"using experience rating to rate all four classes.",null,null,null,null,null,null,"more useful."]
[null,"Given the following:",null,null,null,null,null,null,"High EVPV means there is a lot of volatility in loss experience that isn't explained"]
[null,null,null,"Low Variance of","High Variance of",null,null,null,"by differences between risks in the class. This causes the credibility of the experience"]
[null,null,null,"Hypothetical Means","Hypothetical Means",null,null,null,"rating to decrease, making it less useful."]
[null,null,null,"within Class","within Class",null,null,null,"Hence experience rating is most useful for Class B and least useful for Class C."]
{"$rows_left_out":9}
{"sheet":"10","index":13,"n_rows":51,"n_cols":9,"rows_kept":51,"cut":false,"hidden":false,"merged":[]}
[10,"Finished",null,null,null,null,"Navigator",null,"Solution"]
[null,null,null,null,null,null,null,"(a)","Line of business 1 has an increasing standard loss ratio. This indicates the experience"]
["Points","An actuary has created new models to calculate the experience modification factor for two lines of",null,null,null,null,null,null,"rating is identify differences between risks. Since there is no experience plan currently"]
[{"$f":"INDEX('Point Grid'!B:B,MATCH('10'!A1,'Point Grid'!A:A,0))","v":1.5},"business. Given the following:",null,null,null,null,null,null,"in place, and the standard loss ratio of the proposal is flatter than the experience modifications proposed,"]
[null,"   • Line of business 1 (currently does not use experience rating)",null,null,null,null,null,null,"this suggests the model is also correcting for differences between risks."]
[null,null,null,null,null,null,null,null,"Therefore, I would implement the proposal."]
[]
[null,null,null,null,null,null,null,"(b)","Not enough credibility is given to the actual experience because the standard loss ratios"]
{"$rows_left_out":44}
{"sheet":"11","index":14,"n_rows":38,"n_cols":14,"rows_kept":38,"cut":false,"hidden":false,"merged":[]}
[11,"Finished",null,null,null,null,"Navigator",null,"Solution"]
[null,null,null,null,null,null,null,"(a)",null,null,null,"Here, Z = 0.75, A = 37,100 and E = 32,000."]
["Points","Consider the following sample of five insurance risks which have been experience rated:"]
[{"$f":"INDEX('Point Grid'!B:B,MATCH('11'!A1,'Point Grid'!A:A,0))","v":3.75},"Risk","Mod","Manual Loss Ratio","Standard Loss Ratio",null,null,null,"So X =",{"$f":"0.75*(D23/32000)+(1-0.75)*1","v":1.1195312500000001}]
[null,1,0.6,0.6,1]
[null,2,0.79,0.8,1.01,null,null,"(b)","The standard loss ratio for risk 3 is its manual loss ratio divided by its experience mod."]
[null,3,"X",0.96,"Y",null,null,null,"i.e. = 0.96 / 1.1195 = 0.8575."]
[null,4,1.1000000000000001,1.1000000000000001,1,null,null,null,"If the experience rating plan is good, it should be close to the other standard loss ratios,"]
{"$rows_left_out":31}
{"sheet":"12","index":15,"n_rows":47,"n_cols":9,"rows_kept":47,"cut":false,"hidden":false,"merged":[]}
[12,"Finished",null,null,null,null,"Navigator",null,"Solution"]
[null,null,null,null,null,null,null,"(a)","Subset B has a significantly different loss distribution than Subset A even though"]
["Points","An actuary is assessing the current Table M underlying the pricing of a book of business. All policies",null,null,null,null,null,null,"they have the same expected loss. The variance of B is greater than that of A which"]
[{"$f":"INDEX('Point Grid'!B:B,MATCH('12'!A1,'Point Grid'!A:A,0))","v":2},"within the book of business have identical expected losses and are expected to have exactly one",null,null,null,null,null,null,"means B should have a higher insurance charge than A for the same entry ratio."]
[null,"claim during the policy period. The actuary divides the book of business into two subsets of ",null,null,null,null,null,null,"Combining A and B to create one table will underprice B and overprice A."]
[null,"policies, Subset A and Subset B, and finds the following distributions of aggregate losses:"]
[null,null,null,null,null,null,null,"(b)","φ(x) = average amount above x divided by the expected amount."]
[null,null,null,null,null,null,null,null,"The expected loss for subset B is (10,000 * 6 + 40,000 * 3 + 80,000 * 1) / 10 = 26,000"]
{"$rows_left_out":40}
{"sheet":"13","index":16,"n_rows":23,"n_cols":9,"rows_kept":23,"cut":false,"hidden":false,"merged":[]}
[13,"Finished",null,"Formula Sheet",null,null,"Navigator",null,"Solution"]
[null,null,null,null,null,null,null,"(a)","Let S be the aggregate loss variable. Then"]
["Points","For a given policy that provides first dollar coverage, there is a 50% probability that no claims will",null,null,null,null,null,null,"Use the formula sheet and given information to find the parameters of the shifted "]
[{"$f":"INDEX('Point Grid'!B:B,MATCH('13'!A1,'Point Grid'!A:A,0))","v":2},"occur during the policy period. Given that a claim does occur, the frequency distribution is shown",null,null,null,null,null,null,"Pareto distribution."]
[null,"below:"]
[null,"Number of Claims","Probability"]
[null,1,0.7]
[null,3,0.2]
{"$rows_left_out":16}
{"sheet":"14","index":17,"n_rows":22,"n_cols":9,"rows_kept":22,"cut":false,"hidden":false,"merged":[]}
[14,"Finished",null,null,null,null,"Navigator",null,"Solution"]
[null,null,null,null,null,null,null,"(a)"]
["Points","An insured is written under a retrospective rating plan with a minimum and a maximum premium",null,null,null,null,null,null,"Here, e = 20,000 and c = 1.07 and E[A] = $825,000"]
[{"$f":"INDEX('Point Grid'!B:B,MATCH('14'!A1,'Point Grid'!A:A,0))","v":2},"with the following parameters:"]
[null,"Loss Conversion Factor",1.07,null,null,null,null,null,"I is the net insurance charge,"]
[null,"Expected Loss",825000]
[null,"Expenses",20000]
[null,"φ(rG)",0.4,null,null,null,null,null,"So ψ(0.5) = 0.8 + 0.5 - 1 = 0.3"]
{"$rows_left_out":15}
{"sheet":"15","index":18,"n_rows":39,"n_cols":10,"rows_kept":39,"cut":false,"hidden":false,"merged":[[0,5,0,6]]}
[15,"Finished",null,"Formula Sheet",null,"Navigator",null,null,"Solution"]
[null,null,null,null,null,null,null,"(a)","From the formula sheet, the excess severity function is"]
["Points","An actuary is pricing a retrospectively rated policy with a per-occurrence limit of 20,000 and no",null,null,null,null,null,null,"We equate this with the fitted regression line to"]
[{"$f":"INDEX('Point Grid'!B:B,MATCH('15'!A1,'Point Grid'!A:A,0))","v":3.5},"minimum or maximum ratable loss.",null,null,null,null,null,null,"determine the shifted Pareto parameters."]
[]
[null,"Using claim data from a group of similar policies, the actuary fit the following regression line to the",null,null,null,null,null,null,"16,112 = β / (α - 1)"]
[null,"to the excess severity to estimate losses using the shifted Pareto distribution. The fitted regression",null,null,null,null,null,null,"0.4467 = 1 / (α - 1)"]
[null,"function is y = 0.4467x + 16112 with R2 = 0.9826.",null,null,null,null,null,null,"So α = 3.24 and β = 36,069"]
{"$rows_left_out":32}
{"sheet":"16","index":19,"n_rows":31,"n_cols":13,"rows_kept":31,"cut":false,"hidden":false,"merged":[[3,3,5,3],[3,4,5,4],[3,2,5,2],[0,5,0,6]]}
[16,"Finished",null,null,null,"Navigator",null,null,"Solution"]
[null,null,null,null,null,null,null,"(a)","The entry ratio for a limited Table M is the actual limited loss / expected limited loss."]
["Points","The loss experience of five similarly sized risks is shown in the table below:",null,null,null,null,null,null,"Risk","Entry Ratio",null,"For the expected limited loss, use the average over all risks"]
[{"$f":"INDEX('Point Grid'!B:B,MATCH('16'!A1,'Point Grid'!A:A,0))","v":3},null,"Risk","Aggregate Unlimited Loss","Aggregate Limited Loss",null,null,null,1,{"$f":"E7/$L$4","v":0.25},null,{"$f":"E12/5","v":120000}]
[null,null,null,null,null,null,null,null,2,{"$f":"E8/$L$4","v":0.5}]
[null,null,null,null,null,null,null,null,3,0.75]
[null,null,1,30000,30000,null,null,null,4,0.5]
[null,null,2,95000,60000,null,null,null,5,3]
{"$rows_left_out":24}
{"sheet":"17","index":20,"n_rows":32,"n_cols":14,"rows_kept":32,"cut":false,"hidden":false,"merged":[[13,2,15,2],[13,3,15,3],[13,1,15,1],[0,5,0,6]]}
[17,"Finished",null,null,null,"Navigator",null,null,"Solution"]
[null,null,null,null,null,null,null,"(a)","Technical Ratio = Expected Loss Ratio + Expected Commission"]
["Points","An insurer is deciding on a proportional reinsurance strategy for the upcoming two years."]
[{"$f":"INDEX('Point Grid'!B:B,MATCH('17'!A1,'Point Grid'!A:A,0))","v":3},"A reinsurer proposed the following sliding-scale commission with a carry-forward ",null,null,null,null,null,null,"Year 1"]
[null,"provision. The contract will be identical for the second year.",null,null,null,null,null,null,"Range","Loss Ratio","Commission","Probability"]
[null,"Minimum Commission:",null,"12.5% at an 80% loss ratio",null,null,null,null,"0% - 50%",{"$f":"C17","v":0.43},0.35,{"$f":"D17","v":0.15}]
[null,"Sliding 1:1 to",null,"27.5% at a 65% loss ratio",null,null,null,null,"50% - 60%",{"$f":"C18","v":0.56999999999999995},{"$f":"35%-0.5*(J7-50%)","v":0.315},{"$f":"D18","v":0.25}]
[null,"Sliding 0.5:1 to a Maximum",null,"35% at a 50% loss ratio",null,null,null,null,"60% - 80%",{"$f":"C19","v":0.68},{"$f":"27.5%-1*(J8-65%)","v":0.245},0.45]
{"$rows_left_out":25}
{"sheet":"18","index":21,"n_rows":67,"n_cols":15,"rows_kept":67,"cut":false,"hidden":false,"merged":[[17,4,19,4],[17,1,19,1],[17,2,19,2],[17,3,19,3]]}
[18,"Finished",null,null,null,"Navigator",null,"Solution"]
[null,null,null,null,null,null,"(a)","Use a volume weighted average loss cost for the layer"]
["Points","A property insurer has an existing Quota Share reinsurance treaty in place. The insurer would",null,null,null,null,null,{"$f":"SUMPRODUCT(C21:C25,E21:E25)/SUM(C21:C25)","v":0.33399999999999996}]
[{"$f":"INDEX('Point Grid'!B:B,MATCH('18'!A1,'Point Grid'!A:A,0))","v":5.5},"like to further reduce its net loss exposure by exploring a proposed Property Per Risk Excess"]
[null,"reinsurance treaty. Given the following:",null,null,null,null,"(b)","Loss cost = Exposure * (Pure Risk Premium)"]
[null,"Existing Quota Share Reinsurance Treaty",null,null,null,null,null,"Exposure = G(1,000,000/MPL) - G(500,000/MPL) where MPL is the maximum possible loss."]
[null,"   • 25% Quota Share"]
[null,"   • 15% Ceding Commission",null,null,null,null,null,"MPL = 1,000,000"]
{"$rows_left_out":60}
{"sheet":"19","index":22,"n_rows":48,"n_cols":9,"rows_kept":48,"cut":false,"hidden":false,"merged":[[0,5,0,6],[29,1,30,1],[32,5,33,5],[34,3,35,3],[34,4,35,4],[34,5,35,5],[29,3,30,3],[29,4,30,4],[29,5,30,5],[32,1,33,1],[34,1,35,1],[32,2,33,2],[34,2,35,2],[32,3,33,3],[32,4,33,4]]}
[19,"Finished",null,null,null,"Navigator",null,null,"Solution"]
[null,null,null,null,null,null,null,"(a)","Using the graph, 750 million corresponds to a return period of 25 years."]
["Points","An insurance company is deciding between three reinsurance treaty options from the same",null,null,null,null,null,null,"This corresponds to a 1/25 = 0.04 = 4% probability."]
[{"$f":"INDEX('Point Grid'!B:B,MATCH('19'!A1,'Point Grid'!A:A,0))","v":1.75},"reinsurance company based on the following output from a catastrophe model:"]
[null,null,null,null,null,null,null,"(b)","Option 1 is the Quota Share because it has the same shape as the gross loss but"]
[null,null,null,null,null,null,null,null,"scaled by a percentage. It has the same coefficient of variation for both the"]
[null,null,null,null,null,null,null,null,"retained and ceded losses which is what we expect when a fixed percentage is "]
[null,null,null,null,null,null,null,null,"ceded."]
{"$rows_left_out":40}