{"text_format":"1","workbook":"xlsx","n_sheets":23,"sheets":["Instructions","Formula Sheet","Point Grid","Navigator","1","2","3","4","5","6","7","8","9","10","11","12","13","14","15","16","17","18","19"],"not_rendered":{"charts":0,"images":10,"macros":1,"external_links":0,"defined_names":0,"comments":0,"pivot_tables":0},"unopened":[],"bounds":{"document_bytes":16777216,"sheet_cells":100000,"rows_first":2000,"rows_last":500,"rows_between":2000,"halvings":0,"cell_chars":16384,"cell_head_chars":4096},"cells_cut":0,"cells_raw":0,"read":"whole","date_system":"1900"}

{"sheet":"Instructions","index":0,"n_rows":32,"n_cols":1,"rows_kept":32,"cut":false,"hidden":false,"merged":[]}
[]
[]
[]
[]
[]
["Instructions"]
[]
["1.) Find a quiet place and allow yourself the full four hour exam period to practice. Treat this just as you would the real exam."]
[]
["2.) Use the Navigator worksheet to see a brief description of each question, its point value and navigate between questions in your preferred order."]
[]
["3.) Answer each question either to the side or below the grey question area."]
[]
["4.) Use cell B1 on each question worksheet to mark whether you finished the question or not. You should use this feature to"]
["       reflect your confidence in your answer. This way you'll know if you're on the money or your guesses were lucky."]
{"$rows_left_out":18}
{"sheet":"Formula Sheet","index":1,"n_rows":27,"n_cols":2,"rows_kept":27,"cut":false,"hidden":false,"merged":[]}
[]
[]
[]
[]
[]
["FORMULA SHEET"]
[]
["• For the negative binomial distribution (for use on question 3):"]
[]
[null,"○"]
[]
[]
[null,"○"]
[]
[]
{"$rows_left_out":13}
{"sheet":"Point Grid","index":2,"n_rows":30,"n_cols":19,"rows_kept":30,"cut":false,"hidden":false,"merged":[[5,1,6,1]]}
[]
[]
[]
[]
["2019 Exam 8"]
[null,"Total Point Value","Sub-Part of Question",null,null,null,null,null,null,null,null,"Your Score","Sub-Part of Question"]
["Question",null,"(a)","(b)","(c)","(d)","(e)","(f)","(g)","Status",null,"Question","(a)","(b)","(c)","(d)","(e)","(f)","(g)"]
[1,{"$f":"SUM(C8:I8)","v":2.25},1.5,0.75,null,null,null,null,null,{"$f":"INDIRECT(\"'\"&A8&\"'!B1\")","v":"Incomplete"},null,{"$f":"A8","v":1},{"$f":"_xlfn.IFNA(IF(ISBLANK(INDEX(INDIRECT(\"'\"&$L8&\"'!$A:$A\"),MATCH(M$7,INDIRECT(\"'\"&$L8&\"'!$A:$A\"),0)+2)),\"\",INDEX(INDIRECT(\"'\"&$L8&\"'!$A:$A\"),MATCH(M$7,INDIRECT(\"'\"&$L8&\"'!$A:$A\"),0)+2)),\"\")","v":""},"","","","","",""]
[2,{"$f":"SUM(C9:I9)","v":2.75},1,0.75,1,null,null,null,null,{"$f":"INDIRECT(\"'\"&A9&\"'!B1\")","v":"Incomplete"},null,{"$f":"A9","v":2},"","","","","","",""]
[3,1.75,1.25,0.5,null,null,null,null,null,"Incomplete",null,3,"","","","","","",""]
[4,3,3,null,null,null,null,null,null,"Incomplete",null,4,"","","","","","",""]
[5,2.75,0.5,0.5,1.5,0.25,null,null,null,"Incomplete",null,5,"","","","","","",""]
[6,2,0.75,0.75,0.5,null,null,null,null,"Incomplete",null,6,"","","","","","",""]
[7,7.5,2.25,1.5,0.25,0.5,1.5,1,0.5,"Incomplete",null,7,"","","","","","",""]
[8,1.5,1.5,null,null,null,null,null,null,"Incomplete",null,8,"","","","","","",""]
{"$rows_left_out":16}
{"sheet":"Navigator","index":3,"n_rows":27,"n_cols":8,"rows_kept":27,"cut":false,"hidden":false,"merged":[[26,0,26,6],[20,0,20,6],[21,0,21,6],[22,0,22,6],[23,0,23,6],[24,0,24,6],[25,0,25,6],[19,0,19,6],[8,0,8,6],[9,0,9,6],[10,0,10,6],[11,0,11,6],[12,0,12,6],[13,0,13,6],[14,0,14,6],[15,0,15,6],[16,0,16,6],[17,0,17,6],[18,0,18,6]]}
[]
[]
[]
[]
[]
["Navigator – Select a question to go to it"]
[]
["Question #",null,null,null,null,null,null,"Status"]
["Q1 -- Couret & Venter -- Multi-Dimensional Credibility -- 2.25 points",null,null,null,null,null,null,{"$f":"'Point Grid'!J8","v":"Incomplete"}]
["Q2 -- Goldburd (GLM) -- Model Validation -- 2.75 points",null,null,null,null,null,null,{"$f":"'Point Grid'!J9","v":"Incomplete"}]
["Q3 -- Bailey & Simon -- Experience Modification -- 1.75 points",null,null,null,null,null,null,{"$f":"'Point Grid'!J10","v":"Incomplete"}]
["Q4 -- Robertson -- Weighted k-means -- 3.00 points",null,null,null,null,null,null,{"$f":"'Point Grid'!J11","v":"Incomplete"}]
["Q5 -- Goldburd (GLM) -- Logistic Models -- 2.75 points",null,null,null,null,null,null,{"$f":"'Point Grid'!J12","v":"Incomplete"}]
["Q6 -- Goldburd (GLM) -- Interaction Terms --2.00 points",null,null,null,null,null,null,{"$f":"'Point Grid'!J13","v":"Incomplete"}]
["Q7 -- Bahnemann -- Expected Ground Up Loss  (IQ) -- 7.50 points",null,null,null,null,null,null,{"$f":"'Point Grid'!J14","v":"Incomplete"}]
{"$rows_left_out":13}
{"sheet":"1","index":4,"n_rows":28,"n_cols":10,"rows_kept":28,"cut":false,"hidden":false,"merged":[[17,3,17,4],[17,5,17,6],[19,5,19,6],[20,5,20,6],[21,5,21,6],[19,3,19,4],[20,3,20,4],[21,3,21,4]]}
[1,"Incomplete",null,null,null,null,null,"Navigator",null,"Solution"]
[]
["Points","An insurer uses five geographical Storm Zones (A, B, C, D, and E) in their rating plan."]
[{"$f":"INDEX('Point Grid'!B:B,MATCH('1'!A1,'Point Grid'!A:A,0))","v":2.25},"The insurer refines their rating plan using the following approach:"]
[null,"• Divide each Storm Zone into numerous geographical sectors."]
[null,"• For each geographical sector and storm type, calculate the observed storm frequency"]
[null,"   as number of storms per year."]
[null,"   ○ There are three storm types defined as Moderate, Strong, and Severe storms."]
[]
[null,"The insurer performs two credibility procedures to produce estimates of the respective"]
[null,"storm frequencies in each sector. The first is a multi-dimensional credibility procedure"]
[null,"and the second is a single-dimensional credibility procedure (utilizing only a single"]
[null,"storm type)."]
[]
["(a)","The multi-dimensional credibility results for a particular sector in Storm Zone C for "]
{"$rows_left_out":14}
{"sheet":"2","index":5,"n_rows":50,"n_cols":14,"rows_kept":50,"cut":false,"hidden":false,"merged":[[0,10,0,11]]}
[2,"Incomplete",null,null,null,null,null,null,null,null,"Navigator",null,null,"Solution"]
[]
["Points","An actuary has built two generalized linear models to predict loss costs. Management has requested a series of model validation"]
[{"$f":"INDEX('Point Grid'!B:B,MATCH('2'!A1,'Point Grid'!A:A,0))","v":2.75},"plots to demonstrate the appropriateness of each of the new models. Output for each model, simple quantile plots, and a"]
[null,"double lift plot are shown below:"]
[null,null,null,"Observation","Actual Loss Cost","Model A Loss Cost","Model B Loss Cost","Earned Premium"]
[null,null,null,1,1500,825,900,1800]
[null,null,null,2,675,765,800,1450]
[null,null,null,3,0,615,350,2375]
[null,null,null,4,2250,900,3000,2625]
[null,null,null,5,5000,1050,3700,4875]
[]
[]
[]
[]
{"$rows_left_out":36}
{"sheet":"3","index":6,"n_rows":17,"n_cols":10,"rows_kept":17,"cut":false,"hidden":false,"merged":[[0,4,0,5]]}
[3,"Incomplete",null,null,"Formula Sheet",null,null,"Navigator",null,"Solution"]
[]
["Points","An insurance company has a private passenger auto book of business with an experience"]
[{"$f":"INDEX('Point Grid'!B:B,MATCH('3'!A1,'Point Grid'!A:A,0))","v":1.75},"modification factor in its rating plan."]
[null,"Given the following:"]
[null,"   • Annual claims for an individual driver follow a negative binomial distribution with "]
[null,"       r = 10."]
[null,"   • The expected claim frequency for the entire book of business is 0.101."]
[null,"   • The credibility for the group of risks that have had at least one accident in the last year"]
[null,"      is 0.02."]
[]
["(a)","Calculate the experience modification factor for a policy that has had at least one"]
[{"$f":"INDEX('Point Grid'!$C$8:$I$26,MATCH($A$1,'Point Grid'!$A$8:$A$26,0),MATCH(A12,'Point Grid'!$C$7:$I$7,0))","v":1.25},"accident in the last year."]
[]
[]
{"$rows_left_out":3}
{"sheet":"4","index":7,"n_rows":20,"n_cols":9,"rows_kept":20,"cut":false,"hidden":false,"merged":[]}
[4,"Incomplete",null,null,null,null,"Navigator",null,"Solution"]
[]
["Points","An actuary wants to cluster six workers compensation classes based on excess ratios at"]
[{"$f":"INDEX('Point Grid'!B:B,MATCH('4'!A1,'Point Grid'!A:A,0))","v":3},"two limits: 750,000 and 1,500,000. The actuary decides to use a weighted k-means"]
[null,"algorithm with three clusters. Given the following:"]
[null,"Class","On-Leveled Earned Premium","Normalized Excess Ratio at 750,000 Limit","Normalized Excess Ratio at 1,500,000 Limit","Initial Cluster"]
[null,1,7000000,0.25,9.5000000000000001E-2,"A"]
[null,2,8000000,0.2,0.08,"B"]
[null,3,7500000,0.17,6.2E-2,"C"]
[null,4,6000000,0.13,4.8000000000000001E-2,"A"]
[null,5,5000000,0.45,0.217,"A"]
[null,6,8500000,0.24,9.8000000000000004E-2,"B"]
[]
[null,"• At the start of the algorithm, the actuary randomly assigned each class to a cluster."]
[null,"• The actuary has observed that the 750,000 limit is selected by the insured 75% of the"]
{"$rows_left_out":6}
{"sheet":"5","index":8,"n_rows":27,"n_cols":9,"rows_kept":27,"cut":false,"hidden":false,"merged":[]}
[5,"Incomplete",null,null,null,null,"Navigator",null,"Solution"]
[]
["Points","The following confusion matrix shows the results from a claim fraud model with a "]
[{"$f":"INDEX('Point Grid'!B:B,MATCH('5'!A1,'Point Grid'!A:A,0))","v":2.75},"discrimination threshold of 25%:"]
[null,null,"Predicted"]
[null,"Actual","Yes","No"]
[null,"Yes",72,162]
[null,"No",63,1203]
[]
["(a)","Identify a link function that can be used for a generalized linear model that has a binary"]
[{"$f":"INDEX('Point Grid'!$C$8:$I$26,MATCH($A$1,'Point Grid'!$A$8:$A$26,0),MATCH(A10,'Point Grid'!$C$7:$I$7,0))","v":0.5},"target variable and briefly explain why this link function is appropriate."]
[]
[]
["(b)","Calculate the sensitivity and specificity from the above data."]
[{"$f":"INDEX('Point Grid'!$C$8:$I$26,MATCH($A$1,'Point Grid'!$A$8:$A$26,0),MATCH(A14,'Point Grid'!$C$7:$I$7,0))","v":0.5}]
{"$rows_left_out":13}
{"sheet":"6","index":9,"n_rows":31,"n_cols":9,"rows_kept":31,"cut":false,"hidden":false,"merged":[]}
[6,"Incomplete",null,null,null,null,"Navigator",null,"Solution"]
[]
["Points","An actuary creates a generalized linear model (GLM) to estimate commercial property claim"]
[{"$f":"INDEX('Point Grid'!B:B,MATCH('6'!A1,'Point Grid'!A:A,0))","v":2},"frequency by occupancy class and amount of insurance (AOI) for sprinklered and"]
[null,"non-sprinklered risks. Given the following:"]
[null,"   • Occupancy class is a categorical variable with four levels: Class 1, 2, 3 and 4."]
[null,"   • Sprinklered status is a categorical variable with two levels: sprinklered and "]
[null,"      non-sprinklered."]
[null,"   • The natural log of AOI, ln(AOI), is a continuous variable."]
[null,"   • The log link function is selected."]
[null,"   • An interaction variable is included as ln(AOI) for sprinklered and zero otherwise."]
[null,"   • The model results are as follows:"]
[null,null,"Parameter",null,"Coefficient"]
[null,null,"Intercept",null,-8.4606999999999992]
[null,null,"Occupancy Class 2",null,0.27139999999999997]
{"$rows_left_out":17}
{"sheet":"7","index":10,"n_rows":79,"n_cols":14,"rows_kept":79,"cut":false,"hidden":false,"merged":[[0,10,0,11],[0,5,0,6],[20,3,20,4],[21,3,21,4],[39,7,39,8],[5,6,5,7],[6,6,6,7],[7,6,7,7],[8,6,8,7],[19,3,19,4],[12,3,12,4],[13,3,13,4],[14,3,14,4],[15,3,15,4]]}
[7,"Incomplete",null,null,null,"Formula Sheet",null,null,null,null,"Navigator",null,null,"Solution"]
[]
["Points","An actuary is pricing a workers compensation policy. Given the following:"]
[{"$f":"INDEX('Point Grid'!B:B,MATCH('7'!A1,'Point Grid'!A:A,0))","v":7.5},null,"Policy Effective Date",null,null,null,"2020-01-01"]
[null,null,"Policy Term",null,null,null,"One year"]
[null,null,"Annual Loss Trend",null,null,null,4.4999999999999998E-2]
[null,null,"Cap for individual claims",null,null,null,100000]
[null,null,"Credibility factor",null,null,null,0.4]
[null,null,"Expected ultimate loss before modification",null,null,null,1064000]
[]
[null,"As of June 30, 2019, ground up reported losses are:"]
[null,null,"Policy Year","Total Reported Loss",null,"Individual Claims over $100,000"]
[null,null,2016,392457,null,128305]
[null,null,2017,1013863,null,525626,152860]
[null,null,2018,459798,null,275865]
{"$rows_left_out":65}
{"sheet":"8","index":11,"n_rows":19,"n_cols":9,"rows_kept":19,"cut":false,"hidden":false,"merged":[]}
[8,"Incomplete",null,null,null,null,"Navigator",null,"Solution"]
[]
["Points","Given the following for a policy:"]
[{"$f":"INDEX('Point Grid'!B:B,MATCH('8'!A1,'Point Grid'!A:A,0))","v":1.5},"   • Basic Limit = 100,000"]
[null,"   • Expected Basic Limit Indemnity = 65,000"]
[null,"   • Allocated Loss Adjustment Expense (ALAE) = 20% of Indemnity"]
[null,"   • Unallocated Loss Adjustment Expense = 1.5% of Indemnity and ALAE"]
[null,"   • All other expenses are variable and are 15% of the premium"]
[null,"   • Risk load = 0%"]
[null,"   • Profit load = 2.5%"]
[null,"   • The following table shows Indemnity-only limited expected severity:"]
[null,null,"Limit","E[X; L]"]
[null,null,100000,58750]
[null,null,200000,100000]
[null,null,500000,156250]
{"$rows_left_out":5}
{"sheet":"9","index":12,"n_rows":15,"n_cols":9,"rows_kept":15,"cut":false,"hidden":false,"merged":[[8,3,9,3],[8,4,9,4],[10,3,11,3],[10,4,11,4],[8,1,9,2],[10,1,11,2]]}
[9,"Incomplete",null,null,null,null,"Navigator",null,"Solution"]
[]
["Points","An insurer's risk classification system contains four classes (A, B, C, and D). The insurer is considering"]
[{"$f":"INDEX('Point Grid'!B:B,MATCH('9'!A1,'Point Grid'!A:A,0))","v":1},"using experience rating to rate all four classes."]
[null,"Given the following:"]
[null,null,null,"Low Variance of","High Variance of"]
[null,null,null,"Hypothetical Means","Hypothetical Means"]
[null,null,null,"within Class","within Class"]
[null,"Low Expected Value of \nProcess Variance",null,"Class A","Class B"]
[]
[null,"High Expected Value of\nProcess Variance",null,"Class C","Class D"]
[]
[]
["(a)","From the insurer's perspective, briefly explain the class for which experience rating is expected to be"]
[{"$f":"INDEX('Point Grid'!$C$8:$I$26,MATCH($A$1,'Point Grid'!$A$8:$A$26,0),MATCH(A14,'Point Grid'!$C$7:$I$7,0))","v":1},"the most useful and the class for which experience rating is expected to be the least useful."]
{"$rows_left_out":1}
{"sheet":"10","index":13,"n_rows":50,"n_cols":9,"rows_kept":50,"cut":false,"hidden":false,"merged":[]}
[10,"Incomplete",null,null,null,null,"Navigator",null,"Solution"]
[]
["Points","An actuary has created new models to calculate the experience modification factor for two lines of"]
[{"$f":"INDEX('Point Grid'!B:B,MATCH('10'!A1,'Point Grid'!A:A,0))","v":1.5},"business. Given the following:"]
[null,"   • Line of business 1 (currently does not use experience rating)"]
[]
[]
[]
[]
[]
[]
[]
[]
[]
[]
{"$rows_left_out":36}
{"sheet":"11","index":14,"n_rows":37,"n_cols":9,"rows_kept":37,"cut":false,"hidden":false,"merged":[]}
[11,"Incomplete",null,null,null,null,"Navigator",null,"Solution"]
[]
["Points","Consider the following sample of five insurance risks which have been experience rated:"]
[{"$f":"INDEX('Point Grid'!B:B,MATCH('11'!A1,'Point Grid'!A:A,0))","v":3.75},"Risk","Mod","Manual Loss Ratio","Standard Loss Ratio"]
[null,1,0.6,0.6,1]
[null,2,0.79,0.8,1.01]
[null,3,"X",0.96,"Y"]
[null,4,1.1000000000000001,1.1000000000000001,1]
[null,5,1.1399999999999999,1.1499999999999999,1.01]
[]
[null,"The actual claims for Risk 3 in the experience period are as follows:"]
[null,null,"Claim #","Incurred Loss Amount"]
[null,null,"001",3200]
[null,null,"002",3000]
[null,null,"003",2800]
{"$rows_left_out":23}
{"sheet":"12","index":15,"n_rows":46,"n_cols":9,"rows_kept":46,"cut":false,"hidden":false,"merged":[]}
[12,"Incomplete",null,null,null,null,"Navigator",null,"Solution"]
[]
["Points","An actuary is assessing the current Table M underlying the pricing of a book of business. All policies"]
[{"$f":"INDEX('Point Grid'!B:B,MATCH('12'!A1,'Point Grid'!A:A,0))","v":2},"within the book of business have identical expected losses and are expected to have exactly one"]
[null,"claim during the policy period. The actuary divides the book of business into two subsets of "]
[null,"policies, Subset A and Subset B, and finds the following distributions of aggregate losses:"]
[]
[]
[]
[]
[]
[]
[]
[]
[]
{"$rows_left_out":32}
{"sheet":"13","index":16,"n_rows":22,"n_cols":9,"rows_kept":22,"cut":false,"hidden":false,"merged":[]}
[13,"Incomplete",null,"Formula Sheet",null,null,"Navigator",null,"Solution"]
[]
["Points","For a given policy that provides first dollar coverage, there is a 50% probability that no claims will"]
[{"$f":"INDEX('Point Grid'!B:B,MATCH('13'!A1,'Point Grid'!A:A,0))","v":2},"occur during the policy period. Given that a claim does occur, the frequency distribution is shown"]
[null,"below:"]
[null,"Number of Claims","Probability"]
[null,1,0.7]
[null,3,0.2]
[null,5,0.1]
[]
[null,"The claim-size variable X for this policy follows a shifted Pareto distribution with the following"]
[null,"characteristics:"]
[null,"   • eX(6,000) = 15,000"]
[null,"   • E[X] = 3,000"]
[null,"   • E[X; 4,000] = 1,433.30"]
{"$rows_left_out":8}
{"sheet":"14","index":17,"n_rows":22,"n_cols":9,"rows_kept":22,"cut":false,"hidden":false,"merged":[]}
[14,"Incomplete",null,null,null,null,"Navigator",null,"Solution"]
[]
["Points","An insured is written under a retrospective rating plan with a minimum and a maximum premium"]
[{"$f":"INDEX('Point Grid'!B:B,MATCH('14'!A1,'Point Grid'!A:A,0))","v":2},"with the following parameters:"]
[null,"Loss Conversion Factor",1.07]
[null,"Expected Loss",825000]
[null,"Expenses",20000]
[null,"φ(rG)",0.4]
[null,"φ(rH)",0.8]
[null,"rG",1.21]
[null,"rH",0.5]
[]
["(a)","Calculate the basic premium."]
[{"$f":"INDEX('Point Grid'!$C$8:$I$26,MATCH($A$1,'Point Grid'!$A$8:$A$26,0),MATCH(A13,'Point Grid'!$C$7:$I$7,0))","v":1}]
[]
{"$rows_left_out":8}
{"sheet":"15","index":18,"n_rows":38,"n_cols":9,"rows_kept":38,"cut":false,"hidden":false,"merged":[[0,5,0,6]]}
[15,"Incomplete",null,"Formula Sheet",null,"Navigator",null,null,"Solution"]
[]
["Points","An actuary is pricing a retrospectively rated policy with a per-occurrence limit of 20,000 and no"]
[{"$f":"INDEX('Point Grid'!B:B,MATCH('15'!A1,'Point Grid'!A:A,0))","v":3.5},"minimum or maximum ratable loss."]
[]
[null,"Using claim data from a group of similar policies, the actuary fit the following regression line to the"]
[null,"to the excess severity to estimate losses using the shifted Pareto distribution. The fitted regression"]
[null,"function is y = 0.4467x + 16112 with R2 = 0.9826."]
[]
[]
[]
[]
[]
[]
[]
{"$rows_left_out":24}
{"sheet":"16","index":19,"n_rows":31,"n_cols":9,"rows_kept":31,"cut":false,"hidden":false,"merged":[[3,3,5,3],[3,4,5,4],[3,2,5,2],[0,5,0,6]]}
[16,"Incomplete",null,null,null,"Navigator",null,null,"Solution"]
[]
["Points","The loss experience of five similarly sized risks is shown in the table below:"]
[{"$f":"INDEX('Point Grid'!B:B,MATCH('16'!A1,'Point Grid'!A:A,0))","v":3},null,"Risk","Aggregate Unlimited Loss","Aggregate Limited Loss"]
[]
[]
[null,null,1,30000,30000]
[null,null,2,95000,60000]
[null,null,3,110000,90000]
[null,null,4,160000,60000]
[null,null,5,415000,360000]
[null,null,"Total",{"$f":"SUM(D7:D11)","v":810000},{"$f":"SUM(E7:E11)","v":600000}]
[null,"Limited losses have a per-occurrence limit of 50,000 applied."]
[]
["(a)","Construct a Limited Loss Table M based on the experience above, displaying entry ratios"]
{"$rows_left_out":17}
{"sheet":"17","index":20,"n_rows":23,"n_cols":9,"rows_kept":23,"cut":false,"hidden":false,"merged":[[13,2,15,2],[13,3,15,3],[13,1,15,1],[0,5,0,6]]}
[17,"Incomplete",null,null,null,"Navigator",null,null,"Solution"]
[]
["Points","An insurer is deciding on a proportional reinsurance strategy for the upcoming two years."]
[{"$f":"INDEX('Point Grid'!B:B,MATCH('17'!A1,'Point Grid'!A:A,0))","v":3},"A reinsurer proposed the following sliding-scale commission with a carry-forward "]
[null,"provision. The contract will be identical for the second year."]
[null,"Minimum Commission:",null,"12.5% at an 80% loss ratio"]
[null,"Sliding 1:1 to",null,"27.5% at a 65% loss ratio"]
[null,"Sliding 0.5:1 to a Maximum",null,"35% at a 50% loss ratio"]
[]
[null,"Assume the insurer places no value on the carry-forward provision after the second year, and"]
[null,"ignore the time value of money (i.e., assume a 0% interest rate)."]
[]
[null,"The following table details the expected loss distribution of the underlying business:"]
[null,"Range of Loss Ratios","Average Loss Ratio in Range","Probability of Being in Range"]
[]
{"$rows_left_out":9}
{"sheet":"18","index":21,"n_rows":58,"n_cols":8,"rows_kept":58,"cut":false,"hidden":false,"merged":[[17,4,19,4],[17,1,19,1],[17,2,19,2],[17,3,19,3]]}
[18,"Incomplete",null,null,null,"Navigator",null,"Solution"]
[]
["Points","A property insurer has an existing Quota Share reinsurance treaty in place. The insurer would"]
[{"$f":"INDEX('Point Grid'!B:B,MATCH('18'!A1,'Point Grid'!A:A,0))","v":5.5},"like to further reduce its net loss exposure by exploring a proposed Property Per Risk Excess"]
[null,"reinsurance treaty. Given the following:"]
[null,"Existing Quota Share Reinsurance Treaty"]
[null,"   • 25% Quota Share"]
[null,"   • 15% Ceding Commission"]
[]
[null,"Proposed Property Per Risk Excess Reinsurance Treaty"]
[null,"   • Subject premium of $100 million net of the Quota Share reinsurance treaty"]
[null,"   • Cover net losses in excess of $500,000, up to a limit of $500,000"]
[null,"   • The Quota Share reinsurance treaty will inure to the benefit of this treaty"]
[null,"   • Ceded Loss Ratio for this Excess layer is estimated to be 90%"]
[]
{"$rows_left_out":44}
{"sheet":"19","index":22,"n_rows":47,"n_cols":9,"rows_kept":47,"cut":false,"hidden":false,"merged":[[0,5,0,6],[29,1,30,1],[32,5,33,5],[34,3,35,3],[34,4,35,4],[34,5,35,5],[29,3,30,3],[29,4,30,4],[29,5,30,5],[32,1,33,1],[34,1,35,1],[32,2,33,2],[34,2,35,2],[32,3,33,3],[32,4,33,4]]}
[19,"Incomplete",null,null,null,"Navigator",null,null,"Solution"]
[]
["Points","An insurance company is deciding between three reinsurance treaty options from the same"]
[{"$f":"INDEX('Point Grid'!B:B,MATCH('19'!A1,'Point Grid'!A:A,0))","v":1.75},"reinsurance company based on the following output from a catastrophe model:"]
[]
[]
[]
[]
[]
[]
[]
[]
[]
[]
[]
{"$rows_left_out":32}