{"text_format":"3","workbook":"xlsx","n_sheets":26,"sheets":["Instructions","Point Grid","Navigator","1","2","3","4","5","6","7","8","9","10","11","12","13","14","15","16","17","18","19","20","21","22","23"],"not_rendered":{"images":1},"read":"whole","date_system":"1900"}

{"sheet":"Instructions","index":0,"n_rows":32,"n_cols":1,"rows_kept":32}
[]
[]
[]
[]
[]
["Instructions"]
{"$rows_left_out":27}
{"sheet":"Point Grid","index":1,"n_rows":34,"n_cols":19,"rows_kept":34,"merged":[[5,1,6,1]]}
[]
[]
[]
[]
["Practice Exam 1 – Exam 8"]
[null,"Total Point Value","Sub-Part of Question",{"$nulls":8},"Your Score","Sub-Part of Question"]
{"$rows_left_out":29}
{"sheet":"Navigator","index":2,"n_rows":31,"n_cols":8,"rows_kept":31,"merged":[[8,0,8,6],[9,0,9,6],[10,0,10,6],[11,0,11,6],[12,0,12,6],[13,0,13,6],[14,0,14,6],[15,0,15,6],[16,0,16,6],[17,0,17,6],[18,0,18,6],[19,0,19,6],[20,0,20,6],[21,0,21,6],[22,0,22,6],[23,0,23,6],[24,0,24,6],[25,0,25,6],[26,0,26,6],[27,0,27,6],[28,0,28,6],[29,0,29,6],[30,0,30,6]]}
[]
[]
[]
[]
[]
["Navigator – Select a question to go to it"]
{"$rows_left_out":26}
{"sheet":"1","index":3,"n_rows":34,"n_cols":14,"rows_kept":34}
[1,"Finished",{"$nulls":5},"Navigator",null,"Solution"]
[{"$nulls":8},"a.)","Since high frequency territories are also high average premium territories and the "]
["Points","The following information can be used to calculate the credibility assigned to the",{"$nulls":7},"territory differentials are proper, we use the premiums at present B rates as the exposure base."]
[{"$f":"INDEX('Point Grid'!B:B,MATCH('1'!A1,'Point Grid'!A:A,0))","v":3.5},"experience of a single private passenger car."]
[{"$nulls":9},"Group B frequency",null,{"$f":"F10/E10","v":0.00036}]
[null,"Group","Last Accident","Earned Car Years","Premium at Present B Rates","Number of Claims",{"$nulls":3},"Total frequency",null,{"$f":"F11/E11","v":0.000128099173553719}]
{"$rows_left_out":29}
{"sheet":"2","index":4,"n_rows":33,"n_cols":12,"rows_kept":33}
[2,"Finished",{"$nulls":5},"Navigator",null,"Solution"]
[{"$nulls":8},"a.)","The logit link function is given by:"]
["Points","You are given the following output from a GLM to estimate the probability of a claim:"]
[{"$f":"INDEX('Point Grid'!B:B,MATCH('2'!A1,'Point Grid'!A:A,0))","v":2},"• The actuary selected a Binomial distribution.",{"$nulls":7},"Linear predictor = intercept + driver gender + vehicle body + territory"]
[null,"• The actuary selected the logit link function.",{"$nulls":7},"Intercept",{"$f":"C8","v":-1.485}]
[{"$nulls":9},"Gender",0,"← Since Female is not listed, it is the base class, so its parameter is 0.000 (no deviation needed)"]
{"$rows_left_out":28}
{"sheet":"3","index":5,"n_rows":13,"n_cols":11,"rows_kept":13}
[3,"Finished",{"$nulls":5},"Navigator",null,"Solution"]
[{"$nulls":8},"a.)",4,"Vehicle price is a third order polynomial so has 4 variables including the intercept"]
["Points","You are given a GLM which models liability claim size using the following explanatory variables:",{"$nulls":7},1,"Average driver age is a first order polynomial (e.g. a + b*x) so has 2 variables. "]
[{"$f":"INDEX('Point Grid'!B:B,MATCH('3'!A1,'Point Grid'!A:A,0))","v":2},{"$nulls":9},"However, we've already accounted for the intercept so only 1 new variable."]
[null,"• Vehicle price, which is a continuous variable model with a third order polynomial.",{"$nulls":7},3,"Number of drivers has 4 categories but we do not count the base level."]
[null,"• Average driver age, which is a continuous variable modeled with a first order polynomial.",{"$nulls":7},1,"Gender has 2 categories but we do not count the base level."]
{"$rows_left_out":8}
{"sheet":"4","index":6,"n_rows":31,"n_cols":10,"rows_kept":31}
[4,"Finished",{"$nulls":4},"Navigator",null,"Solution"]
[{"$nulls":7},"a.)","Meyers/Dorweiler criterion does not penalize for the size of the error, instead it penalizes if there "]
["Points","Three experience rating plans have been developed and you are trying to evaluate",{"$nulls":6},"is a pattern to the errors."]
[{"$f":"INDEX('Point Grid'!B:B,MATCH('4'!A1,'Point Grid'!A:A,0))","v":1.5},"which is optimal.  Each rating plan has been tested on four different risks.",{"$nulls":6},"Plan 3 has a downward trend in the error percentages so is not preferred by this measure."]
[]
[null,"The following tables summarize the indicated modifications and the resulting errors.",{"$nulls":6},"Compute the correlation between the predicted modification factors and the errors."]
{"$rows_left_out":26}
{"sheet":"5","index":7,"n_rows":33,"n_cols":12,"rows_kept":33}
[5,"Finished",{"$nulls":4},"Navigator",null,"Solution"]
[{"$nulls":7},"a.)","Since the sample means are normalized within the hazard group, the total hazard group "]
["Points","A multi-dimensional credibility technique has been developed to predict claim frequencies",{"$nulls":6},"relativity is 1.000."]
[{"$f":"INDEX('Point Grid'!B:B,MATCH('5'!A1,'Point Grid'!A:A,0))","v":1.5},"for permanent total (PT) claims."]
[null,"   • Seven years of data were collected.",{"$nulls":6},"Hazard group approach"]
[null,"   • The technique produced a raw predicted relativity based on the oldest five years.",{"$nulls":6},"Quintile","HG","Holdout","(HG - Holdout)^2"]
{"$rows_left_out":28}
{"sheet":"6","index":8,"n_rows":27,"n_cols":12,"rows_kept":27}
[6,"Finished",{"$nulls":6},"Navigator",null,"Solution"]
[{"$nulls":9},"a.)","AIC = -2*log-likelihood + 2p"]
["Points","You are testing the addition of a new categorical variable into an existing GLM, and are",{"$nulls":8},"BIC = -2*log-likelihood + p*ln(n)"]
[null,"given the following information:"]
[{"$nulls":10},"If there are p parameters in the old model then the new model has p+q parameters once the new variable is added."]
[null,"• A is the change in AIC and B is the change in BIC after adding the new variable."]
{"$rows_left_out":22}
{"sheet":"7","index":9,"n_rows":33,"n_cols":19,"rows_kept":33}
[7,"Finished",{"$nulls":5},"Navigator",null,"Solution"]
[{"$nulls":8},"a.)","We need to compute the manual and standard loss ratios for each insured across each rating plan."]
["Points","The following information was taken from two different experience rating plans:",{"$nulls":7},"Make sure to order the risks by increasing experience modification. "]
[{"$f":"INDEX('Point Grid'!B:B,MATCH('7'!A1,'Point Grid'!A:A,0))","v":3}]
[null,null,"Experience Modification",null,"Experience Data",{"$nulls":4},"Plan A"]
[null,"Insured","Plan A","Plan B","Manual Premium","Losses",{"$nulls":3},"Insured","Mod Rank",null,"Rank","Insured","Ranked Mod","Manual Premium","Losses","Manual LR","Standard LR"]
{"$rows_left_out":28}
{"sheet":"8","index":10,"n_rows":36,"n_cols":10,"rows_kept":36}
[8,"Finished",null,null,"Navigator",null,"Solution"]
[{"$nulls":5},"a.)","First, detrend the large loss threshold for two years using the annual claim severity trend."]
["Points","A portfolio of insurance policies currently has the size of loss distribution shown below:",{"$nulls":4},{"$f":"B22/((1+B27)^2)","v":{"v":200012.16073937298,"d":"$200,012.16"}}]
[{"$f":"INDEX('Point Grid'!B:B,MATCH('8'!A1,'Point Grid'!A:A,0))","v":3.5},"Occurrence Limit","Probability that a Claim is less than the Occurrence Limit","Expected Limited Severity for the Occurrence Limit",null,null,"We'll round this to $200,000 to use the table."]
[null,{"v":100000,"d":"100,000"},{"v":0.673,"d":"67.3%"},{"v":48000,"d":"$48,000"},null,null,"This means claims today that are over $200,000 are claims which we expect to be over $250,000 if they occur in "]
[null,{"v":125000,"d":"125,000"},{"v":0.689,"d":"68.9%"},{"v":59000,"d":"$59,000"},null,null,"two year's time based on inflationary estimates."]
{"$rows_left_out":31}
{"sheet":"9","index":11,"n_rows":54,"n_cols":21,"rows_kept":54,"merged":[[0,7,0,8]]}
[9,"Finished",{"$nulls":5},"Navigator",null,null,"Solution"]
[{"$nulls":9},"a.)","Since the company has been with the same insurer on a claims-made program for the last 15 years"]
["Points","Consider the following loss experience as of June 30, 2021 under a claims-made commercial general",{"$nulls":8},"we may assume all data given is for mature claims-made policies."]
[{"$f":"INDEX('Point Grid'!B:B,MATCH('9'!A1,'Point Grid'!A:A,0))","v":4},"liability policy:"]
[{"$nulls":10},"The experience period for the policy we're pricing is the three years prior, lagged by one. So 1/1/2018 – 12/31/2020."]
[null,"Policy Year","Claim Number","Basic Limit Indemnity","ALAE",{"$nulls":5},"So claims 1 and 2 are not relevant."]
{"$rows_left_out":49}
{"sheet":"10","index":12,"n_rows":20,"n_cols":8,"rows_kept":20}
[10,"Finished",{"$nulls":3},"Navigator",null,"Solution"]
[{"$nulls":6},"a.)","Workers' Compensation losses are generally frequency driven (Med Only claims) with the occasional low frequency, high severity loss."]
["Points","Answer the following in the context of the NCCI experience rating formula.",{"$nulls":5},"Splitting into primary and excess components allows the plan to respond to both frequency and severity."]
[{"$f":"INDEX('Point Grid'!B:B,MATCH('10'!A1,'Point Grid'!A:A,0))","v":1.75},{"$nulls":6},"This improves the accuracy of the expected losses."]
[]
["(a)","Explain why splitting the formula into primary and excess components is",{"$nulls":4},"b.)","The primary component is designed to respond to the insured's loss frequency."]
{"$rows_left_out":15}
{"sheet":"11","index":13,"n_rows":30,"n_cols":9,"rows_kept":30}
[11,"Finished",{"$nulls":4},"Navigator",null,"Solution"]
[{"$nulls":7},"a.)","Since this occurred five years ago it is fully reflected within the experience period so it is"]
["Points",{"$nulls":7},"not appropriate for schedule rating."]
[{"$f":"INDEX('Point Grid'!B:B,MATCH('11'!A1,'Point Grid'!A:A,0))","v":2.75},"ABC Incorporated is a theme park operator who is purchasing a Commercial General Liability ",{"$nulls":6},"0% debit/credit out of a maximum of 0%."]
[null,"policy with an effective date of January 1, 2022. Assume ABC Incorporated is eligible for both "]
[null,"experience and schedule rating, and each scenario listed below is independent.",{"$nulls":5},"b.)","Adding a doctor at each location and training staff in emergency first aid should reduce the"]
{"$rows_left_out":25}
{"sheet":"12","index":14,"n_rows":20,"n_cols":13,"rows_kept":20}
[12,"Finished",{"$nulls":4},"Navigator",null,"Solution"]
[{"$nulls":7},"a.)","Credibility must be between 0 and 1."]
["Points",{"$nulls":7},"Credibility increases as the exposure increases."]
[{"$f":"INDEX('Point Grid'!B:B,MATCH('12'!A1,'Point Grid'!A:A,0))","v":3},{"$nulls":7},"Credibility increases at a decreasing rate."]
[]
["(a)","Using words, identify the three criteria that define an effective credibility function ",{"$nulls":5},"b.)","0 <= Z <= 1 where Z is the assigned credibility."]
{"$rows_left_out":15}
{"sheet":"13","index":15,"n_rows":29,"n_cols":11,"rows_kept":29}
[13,"Finished",{"$nulls":4},"Navigator",null,"Solution"]
[{"$nulls":7},"a.)","Since this is a balanced retrospective rating plan we have"]
["Points","The following information applies to a balanced retrospectively rated policy:",{"$nulls":6},"Guaranteed Cost Premium = (e + E)*T where"]
[{"$f":"INDEX('Point Grid'!B:B,MATCH('13'!A1,'Point Grid'!A:A,0))","v":2},{"$nulls":7},"e is the expense figure, E is the loss figure and T is the tax multiplier."]
[null,{"v":26000,"d":"$26,000"},"Standard Premium",{"$nulls":5},"Solving for T yields"]
[null,{"v":24000,"d":"$24,000"},"Guaranteed Cost Premium",{"$nulls":5},"T =",{"$f":"B6/B7","v":1.2}]
{"$rows_left_out":24}
{"sheet":"14","index":16,"n_rows":12,"n_cols":7,"rows_kept":12}
[14,"Finished",null,null,"Navigator",null,"Solution"]
[{"$nulls":5},"a.)","Expected Ground Up Loss"]
["Points","Using the information below, calculate the premium for a $50,000 deductible policy.",{"$nulls":4},{"$f":"B6*B5","v":{"v":204230,"d":"$204,230"}}]
[{"$f":"INDEX('Point Grid'!B:B,MATCH('14'!A1,'Point Grid'!A:A,0))","v":2}]
[null,{"v":314200,"d":"$314,200"},"Standard Premium",{"$nulls":3},"Expected Excess Loss"]
["(a)",{"v":0.65,"d":"65%"},"Expected Loss ratio",{"$nulls":3},{"$f":"G3*(1-B11)","v":{"v":138876.4,"d":"$138,876"}}]
{"$rows_left_out":7}
{"sheet":"15","index":17,"n_rows":50,"n_cols":14,"rows_kept":50,"merged":[[17,2,17,3],[18,2,18,3],[19,2,19,3],[20,2,20,3],[21,2,21,3]]}
[15,"Finished",{"$nulls":4},"Navigator",null,"Solution"]
[{"$nulls":7},"a.)","Since we're not given the expected loss and ALAE for the book of business we must estimate it"]
["Points","An insurer writes five identical workers compensation risks for one year and observes ",{"$nulls":6},"E[A] =",{"$f":"AVERAGE(C18:D22)","v":{"v":1000000,"d":"$1,000,000"}}]
[{"$f":"INDEX('Point Grid'!B:B,MATCH('15'!A1,'Point Grid'!A:A,0))","v":4},"the following:"]
[{"$nulls":8},"Compute the Table M entry ratio for each risk"]
[null,{"v":1250000,"d":"$1,250,000"},"Standard Premium for each risk",{"$nulls":5},"Risk #","Entry Ratio"]
{"$rows_left_out":45}
{"sheet":"16","index":18,"n_rows":40,"n_cols":13,"rows_kept":40}
[16,"Finished",{"$nulls":4},"Navigator",null,"Solution"]
[{"$nulls":7},"a.)","E[A] =",{"$f":"AVERAGE(0,1000000)","v":{"v":500000,"d":"$500,000"}}]
["Points","The following information applies to a company's retrospectively rated Workers'",{"$nulls":6},"Expected retrospective premium is given by R = (B + c*E[L])*T"]
[{"$f":"INDEX('Point Grid'!B:B,MATCH('16'!A1,'Point Grid'!A:A,0))","v":4},"Compensation policy:",{"$nulls":6},"E[L] = E[A] - I, where I is the net insurance charge."]
[null,"   • Its losses are expected to be uniformly distributed on [0, 1,000,000].",{"$nulls":6},"Tax multiplier =",null,{"$f":"1/(1-B11)","v":{"v":1.0526315789473684,"d":"1.05"}}]
[]
{"$rows_left_out":35}
{"sheet":"17","index":19,"n_rows":28,"n_cols":13,"rows_kept":28}
[17,"Finished",{"$nulls":4},"Navigator",null,"Solution"]
[{"$nulls":7},"a.)","The ISO approach to risk loading ILFs is"]
["Points","Given the following information about an insurer's book of business:"]
[{"$f":"INDEX('Point Grid'!B:B,MATCH('17'!A1,'Point Grid'!A:A,0))","v":1.5},{"$nulls":7},"The general formula for (risk-loaded) ILFs is:"]
[null,{"v":10000,"d":"$10,000"},"Basic limit",null,"Claim Size","Probability"]
[null,{"v":250000,"d":"$250,000"},"Policy limit",null,{"v":250,"d":"$250"},0.1768]
{"$rows_left_out":23}
{"sheet":"18","index":20,"n_rows":52,"n_cols":17,"rows_kept":52,"merged":[[0,6,0,7]]}
[18,"Finished",{"$nulls":4},"Navigator",null,null,"Solution"]
[{"$nulls":8},"a.)"]
["Points","An insured is subject to experience rating under the National Council on Compensation Insurance "]
[{"$f":"INDEX('Point Grid'!B:B,MATCH('18'!A1,'Point Grid'!A:A,0))","v":3},"(NCCI) Experience Rating Plan Manual for Workers Compensation and Employers Liability Insurance."]
[{"$nulls":9},"Use the class code to look up the associated ELR and D-ratio."]
[null,"The following information about the insured is given:",{"$nulls":7},"ELR","D-ratio"]
{"$rows_left_out":47}
{"sheet":"19","index":21,"n_rows":31,"n_cols":15,"rows_kept":31}
[19,"Finished",{"$nulls":6},"Navigator",null,"Solution"]
[{"$nulls":9},"a.)","Loss elimination ratio = C(d) ="]
["Points"]
[{"$f":"INDEX('Point Grid'!B:B,MATCH('19'!A1,'Point Grid'!A:A,0))","v":2.5},"Given the following information about an insurer's book of business which ",{"$nulls":8},"Modified Frequency = φ(1- FX(d))"]
[null,"utilizes straight deductibles:"]
[{"$nulls":10},"Modified Severity ="]
{"$rows_left_out":26}
{"sheet":"20","index":22,"n_rows":38,"n_cols":18,"rows_kept":38,"merged":[[0,8,0,9]]}
[20,"Finished",{"$nulls":6},"Navigator",null,null,"Solution"]
[{"$nulls":10},"a.)",null,null,"Modified","Excess","Expected","Policy"]
["Points","Given the following information about a retrospectively rated Workers' Compensation policy which is",{"$nulls":10},"Hazard","Expected","Ratio at","Excess","Excess"]
[{"$f":"INDEX('Point Grid'!B:B,MATCH('20'!A1,'Point Grid'!A:A,0))","v":2.5},"also subject to experience rating.",{"$nulls":9},"State","Group","Loss","Loss Limit","Loss","Ratio"]
[{"$nulls":11},"X","A",{"$f":"$B$6*D11*$B$7","v":{"v":43890,"d":"43,890"}},{"$f":"E11","v":0.72},{"$f":"N5*O5","v":{"v":31600.8,"d":"31,601"}}]
[null,0.95,"Experience Modification Factor",{"$nulls":4},"Table of Policy Excess Ratio Ranges",{"$nulls":3},"Y","B",{"$f":"$B$6*D12*$B$7","v":{"v":75240,"d":"75,240"}},{"$f":"E12","v":0.05},{"$f":"N6*O6","v":{"v":3762,"d":"3,762"}}]
{"$rows_left_out":33}
{"sheet":"21","index":23,"n_rows":30,"n_cols":14,"rows_kept":30}
[21,"Finished",{"$nulls":5},"Navigator",null,"Solution"]
[{"$nulls":8},"a.)","Size","F(x)","E[X; x]","e(x)","Fitted"]
["Points","An actuary wishes to fit a claim size distribution to a sample of 1,000 claims.",{"$nulls":7},100,{"$f":"SUM(D6:$D$6)/$D$13","v":0.099},{"$f":"(SUM(E6:$E$6)+SUM(D7:$D$12)*J3)/$D$13","v":{"v":95.1,"d":"95"}},{"$f":"($K$11-L3)/(1-K3)","v":{"v":1219.6448390677026,"d":"1,219.64"}},{"$f":"_xlfn.FORECAST.LINEAR(J3,$M$3:$M$8,$J$3:$J$8)","v":{"v":1253.0416589072365,"d":"1,253.04"}}]
[{"$f":"INDEX('Point Grid'!B:B,MATCH('21'!A1,'Point Grid'!A:A,0))","v":2.25},{"$nulls":8},500,{"$f":"SUM(D$6:$D7)/$D$13","v":0.392},{"$f":"(SUM(E$6:$E7)+SUM(D8:$D$12)*J4)/$D$13","v":393},{"$f":"($K$11-L4)/(1-K4)","v":{"v":1317.4342105263158,"d":"1,317.43"}},{"$f":"_xlfn.FORECAST.LINEAR(J4,$M$3:$M$8,$J$3:$J$8)","v":{"v":1330.137979204394,"d":"1,330.14"}}]
[null,null,"Size Group","# Claims","Total Loss","Severity",{"$nulls":3},{"v":1000,"d":"1,000"},{"$f":"SUM(D$6:$D8)/$D$13","v":0.613},{"$f":"(SUM(E$6:$E8)+SUM(D9:$D$12)*J5)/$D$13","v":638},{"$f":"($K$11-L5)/(1-K5)","v":{"v":1436.6925064599484,"d":"1,436.69"}},{"v":1426.5083795758405,"d":"1,426.51"}]
[null,null,"0 – 100",99,{"v":5000,"d":"5,000"},{"$f":"E6/D6","v":{"v":50.505050505050505,"d":"51"}},{"$nulls":3},{"v":2000,"d":"2,000"},{"$f":"SUM(D$6:$D9)/$D$13","v":0.826},{"$f":"(SUM(E$6:$E9)+SUM(D10:$D$12)*J6)/$D$13","v":904},{"v":1666.6666666666663,"d":"1,666.67"},{"v":1619.249180318734,"d":"1,619.25"}]
{"$rows_left_out":25}
{"sheet":"22","index":24,"n_rows":40,"n_cols":9,"rows_kept":40,"merged":[[0,5,0,6]]}
[22,"Finished",{"$nulls":3},"Navigator",null,null,"Solution"]
[{"$nulls":7},"b.)","Large data sets can lead to dense clouds of deviance residuals which makes pattern recognition challenging."]
["Points","An actuary is about to peer review a GLM. They are refreshing their memory on some model",{"$nulls":6},"The residuals should be binned prior to graphing. One way of doing this is to use binned working residuals."]
[{"$f":"INDEX('Point Grid'!B:B,MATCH('22'!A1,'Point Grid'!A:A,0))","v":1.75},"refinement techniques."]
[{"$nulls":7},"c.)","i.) TRUE"]
[{"$nulls":8},"ii.) FALSE - a good model has normally distributed deviance residuals"]
{"$rows_left_out":24}
{"sheet":"23","index":25,"n_rows":25,"n_cols":12,"rows_kept":25,"merged":[[0,6,0,7]]}
[23,"Finished",{"$nulls":4},"Navigator",null,null,"Solution"]
[{"$nulls":8},"a.)","The GLM relativity and the βj coefficients are not on the same scale because the GLM relativities have had their link function inverted."]
["Points","An actuary has built a GLM for a countrywide rating plan. ",{"$nulls":7},"Therefore, the rating factors are given by (GLM Relativity)*exp(βj)"]
[{"$f":"INDEX('Point Grid'!B:B,MATCH('23'!A1,'Point Grid'!A:A,0))","v":2},"They are using a lasso credibility model with a log-link function to produce"]
[null,"a rating plan for one of their mid-size states.",{"$nulls":9},"Lasso"]
[null,"The actuary uses the relativities from the countrywide GLM as the offsets.",{"$nulls":7},"VehicleType",null,"Relativity"]
{"$rows_left_out":19}