{"text_format":"3","workbook":"xlsx","n_sheets":26,"sheets":["Instructions","Point Grid","Navigator","1","2","3","4","5","6","7","8","9","10","11","12","13","14","15","16","17","18","19","20","21","22","23"],"not_rendered":{"images":1},"read":"whole","date_system":"1900"}

{"sheet":"Instructions","index":0,"n_rows":32,"n_cols":1,"rows_kept":32}
[]
[]
[]
[]
[]
["Instructions"]
[]
["1.) Find a quiet place and allow yourself the full four hour exam period to practice. Treat this just as you would the real exam."]
[]
["2.) Use the Navigator worksheet to see a brief description of each question, its point value and navigate between questions in your preferred order."]
[]
["3.) Answer each question either to the side or below the grey question area."]
[]
["4.) Use cell B1 on each question worksheet to mark whether you finished the question or not. You should use this feature to"]
["       reflect your confidence in your answer. This way you'll know if you're on the money or your guesses were lucky."]
{"$rows_left_out":18}
{"sheet":"Point Grid","index":1,"n_rows":34,"n_cols":19,"rows_kept":34,"merged":[[5,1,6,1]]}
[]
[]
[]
[]
["Practice Exam 1 – Exam 8"]
[null,"Total Point Value","Sub-Part of Question",{"$nulls":8},"Your Score","Sub-Part of Question"]
["Question",null,"(a)","(b)","(c)","(d)","(e)","(f)","(g)","Status",null,"Question","(a)","(b)","(c)","(d)","(e)","(f)","(g)"]
[1,{"$f":"SUM(C8:I8)","v":{"v":3.5,"d":"3.50"}},{"v":2.5,"d":"2.50"},{"v":1,"d":"1.00"},{"$nulls":5},{"$f":"INDIRECT(\"'\"&A8&\"'!B1\")","v":"Incomplete"},null,{"$f":"A8","v":1},{"$f":"_xlfn.IFNA(IF(ISBLANK(INDEX(INDIRECT(\"'\"&$L8&\"'!$A:$A\"),MATCH(M$7,INDIRECT(\"'\"&$L8&\"'!$A:$A\"),0)+2)),\"\",INDEX(INDIRECT(\"'\"&$L8&\"'!$A:$A\"),MATCH(M$7,INDIRECT(\"'\"&$L8&\"'!$A:$A\"),0)+2)),\"\")","v":""},"","","","","",""]
[2,{"$f":"SUM(C9:I9)","v":{"v":2,"d":"2.00"}},{"v":2,"d":"2.00"},{"$nulls":6},{"$f":"INDIRECT(\"'\"&A9&\"'!B1\")","v":"Incomplete"},null,{"$f":"A9","v":2},"","","","","","",""]
[3,{"v":2,"d":"2.00"},{"v":2,"d":"2.00"},{"$nulls":6},"Incomplete",null,3,"","","","","","",""]
[4,{"v":1.5,"d":"1.50"},{"v":1.5,"d":"1.50"},{"$nulls":6},"Incomplete",null,4,"","","","","","",""]
[5,{"v":1.5,"d":"1.50"},{"v":1.5,"d":"1.50"},{"$nulls":6},"Incomplete",null,5,"","","","","","",""]
[6,2.75,{"v":1.5,"d":"1.50"},0.25,{"v":1,"d":"1.00"},{"$nulls":4},"Incomplete",null,6,"","","","","","",""]
[7,{"v":3,"d":"3.00"},{"v":2.5,"d":"2.50"},{"v":0.5,"d":"0.50"},{"$nulls":5},"Incomplete",null,7,"","","","","","",""]
[8,{"v":3.5,"d":"3.50"},{"v":1.5,"d":"1.50"},{"v":2,"d":"2.00"},{"$nulls":5},"Incomplete",null,8,"","","","","","",""]
{"$rows_left_out":20}
{"sheet":"Navigator","index":2,"n_rows":31,"n_cols":8,"rows_kept":31,"merged":[[8,0,8,6],[9,0,9,6],[10,0,10,6],[11,0,11,6],[12,0,12,6],[13,0,13,6],[14,0,14,6],[15,0,15,6],[16,0,16,6],[17,0,17,6],[18,0,18,6],[19,0,19,6],[20,0,20,6],[21,0,21,6],[22,0,22,6],[23,0,23,6],[24,0,24,6],[25,0,25,6],[26,0,26,6],[27,0,27,6],[28,0,28,6],[29,0,29,6],[30,0,30,6]]}
[]
[]
[]
[]
[]
["Navigator – Select a question to go to it"]
[]
["Question #",{"$nulls":6},"Status"]
["Q1 -- Bailey & Simon -- Relative Credibility -- 3.50 points",{"$nulls":6},{"$f":"'Point Grid'!J8","v":"Incomplete"}]
["Q2 -- GLM -- Estimate probability using GLM output -- 2.00 points",{"$nulls":6},{"$f":"'Point Grid'!J9","v":"Incomplete"}]
["Q3 -- GLM -- Number of Parameters within a GLM -- 2.00 points",{"$nulls":6},{"$f":"'Point Grid'!J10","v":"Incomplete"}]
["Q4 -- Mahler -- Criteria for Credibility -- 1.50 points",{"$nulls":6},{"$f":"'Point Grid'!J11","v":"Incomplete"}]
["Q5 -- Couret & Venter -- Determine best approach using SSE -- 1.50 points",{"$nulls":6},{"$f":"'Point Grid'!J12","v":"Incomplete"}]
["Q6 -- GLM -- Adding variables to a GLM or GLMM -- 2.75 points",{"$nulls":6},{"$f":"'Point Grid'!J13","v":"Incomplete"}]
["Q7 -- Fisher -- Rating Plan Equity -- 3.00 points",{"$nulls":6},{"$f":"'Point Grid'!J14","v":"Incomplete"}]
{"$rows_left_out":17}
{"sheet":"1","index":3,"n_rows":23,"n_cols":10,"rows_kept":23}
[1,"Incomplete",{"$nulls":5},"Navigator",null,"Solution"]
[{"$nulls":8},"a.)"]
["Points","The following information can be used to calculate the credibility assigned to the"]
[{"$f":"INDEX('Point Grid'!B:B,MATCH('1'!A1,'Point Grid'!A:A,0))","v":3.5},"experience of a single private passenger car."]
[]
[null,"Group","Last Accident","Earned Car Years","Premium at Present B Rates","Number of Claims"]
[null,"A","3+",{"v":671000,"d":"671,000"},{"v":600000000,"d":"600,000,000"},{"v":60000,"d":"60,000"}]
[null,"X",2,{"v":553000,"d":"553,000"},{"v":225000000,"d":"225,000,000"},{"v":25000,"d":"25,000"}]
[null,"Y",1,{"v":120000,"d":"120,000"},{"v":93000000,"d":"93,000,000"},{"v":21000,"d":"21,000"}]
[null,"B",0,"M",{"v":50000000,"d":"50,000,000"},{"v":18000,"d":"18,000"}]
[null,"Total",null,{"$f":"TEXT(SUM(D7:D9),\"0,000\")&\" + M\"","v":"1,344,000 + M"},{"$f":"SUM(E7:E10)","v":{"v":968000000,"d":"968,000,000"}},{"$f":"SUM(F7:F10)","v":{"v":124000,"d":"124,000"}}]
[]
[null,"You may assume the following:"]
[null,"   • High frequency territories are also high average premium territories."]
[null,"   • Territory differentials are proper."]
{"$rows_left_out":9}
{"sheet":"2","index":4,"n_rows":33,"n_cols":10,"rows_kept":33}
[2,"Incomplete",{"$nulls":5},"Navigator",null,"Solution"]
[{"$nulls":8},"a.)"]
["Points","You are given the following output from a GLM to estimate the probability of a claim:"]
[{"$f":"INDEX('Point Grid'!B:B,MATCH('2'!A1,'Point Grid'!A:A,0))","v":2},"• The actuary selected a Binomial distribution."]
[null,"• The actuary selected the logit link function."]
[]
[null,"Parameter","β"]
[null,"Intercept",-1.485]
[]
[null,"Vehicle Body"]
[null,"Coupe",-0.881]
[null,"Roadster",-1.047]
[null,"Sedan",-1.175]
[null,"Station Wagon",-1.083]
[null,"Truck",-1.118]
{"$rows_left_out":19}
{"sheet":"3","index":5,"n_rows":12,"n_cols":10,"rows_kept":12}
[3,"Incomplete",{"$nulls":5},"Navigator",null,"Solution"]
[{"$nulls":8},"a.)"]
["Points","You are given a GLM which models liability claim size using the following explanatory variables:"]
[{"$f":"INDEX('Point Grid'!B:B,MATCH('3'!A1,'Point Grid'!A:A,0))","v":2}]
[null,"• Vehicle price, which is a continuous variable model with a third order polynomial."]
[null,"• Average driver age, which is a continuous variable modeled with a first order polynomial."]
[null,"• Number of drivers, which is a categorical variable with four levels."]
[null,"• Gender, which is a categorical variable with two levels."]
[null,"• There is only one interaction in the model, which is between gender and average driver age."]
[]
["(a)","Determine the maximum number of β parameters in this model."]
[{"$f":"INDEX('Point Grid'!$C$8:$I$28,MATCH($A$1,'Point Grid'!$A$8:$A$28,0),MATCH(A11,'Point Grid'!$C$7:$I$7,0))","v":2}]

{"sheet":"4","index":6,"n_rows":31,"n_cols":9,"rows_kept":31}
[4,"Incomplete",{"$nulls":4},"Navigator",null,"Solution"]
[{"$nulls":7},"a.)"]
["Points","Three experience rating plans have been developed and you are trying to evaluate"]
[{"$f":"INDEX('Point Grid'!B:B,MATCH('4'!A1,'Point Grid'!A:A,0))","v":1.5},"which is optimal.  Each rating plan has been tested on four different risks."]
[]
[null,"The following tables summarize the indicated modifications and the resulting errors."]
[]
[null,"Plan 1"]
[null,"Risk #","Predicted Modification Factor","Error"]
[null,1,1.2,{"v":0.5,"d":"50%"}]
[null,2,1.2,{"v":0.45,"d":"45%"}]
[null,3,0.7,{"v":0.2,"d":"20%"}]
[null,4,0.7,{"v":0.3,"d":"30%"}]
[]
[null,"Plan 2"]
{"$rows_left_out":17}
{"sheet":"5","index":7,"n_rows":19,"n_cols":9,"rows_kept":19}
[5,"Incomplete",{"$nulls":4},"Navigator",null,"Solution"]
[{"$nulls":7},"a.)"]
["Points","A multi-dimensional credibility technique has been developed to predict claim frequencies"]
[{"$f":"INDEX('Point Grid'!B:B,MATCH('5'!A1,'Point Grid'!A:A,0))","v":1.5},"for permanent total (PT) claims."]
[null,"   • Seven years of data were collected."]
[null,"   • The technique produced a raw predicted relativity based on the oldest five years."]
[null,"   • The most recent two years were used as the holdout sample."]
[null,"   • The sample means are normalized within a hazard group."]
[]
[null,"Quintile","Holdout Sample Relativity","Prediction Based on Raw","Prediction Based on Credibility Procedure"]
[null,1,0.55,0.4,0.45]
[null,2,0.9,0.6,0.7]
[null,3,1.1,1.05,1.15]
[null,4,1.25,1.5,1.3]
[null,5,1.5,2.5,1.9]
{"$rows_left_out":5}
{"sheet":"6","index":8,"n_rows":26,"n_cols":11,"rows_kept":26}
[6,"Incomplete",{"$nulls":6},"Navigator",null,"Solution"]
[{"$nulls":9},"a.)"]
["Points","You are testing the addition of a new categorical variable into an existing GLM, and are"]
[null,"given the following information:"]
[]
[null,"• A is the change in AIC and B is the change in BIC after adding the new variable."]
[null,"• B > A + 100"]
[]
[null,{"v":5000,"d":"5,000"},"Number of observations in the model"]
[]
["(a)","Calculate the minimum possible number of levels in the new categorical variable."]
[{"$f":"INDEX('Point Grid'!$C$8:$I$28,MATCH($A$1,'Point Grid'!$A$8:$A$28,0),MATCH(A11,'Point Grid'!$C$7:$I$7,0))","v":1.5}]
[]
[]
[null,"Suppose instead the new categorical is added as a random effect, turning the GLM into a"]
{"$rows_left_out":12}
{"sheet":"7","index":9,"n_rows":32,"n_cols":10,"rows_kept":32}
[7,"Incomplete",{"$nulls":5},"Navigator",null,"Solution"]
[{"$nulls":8},"a.)"]
["Points","The following information was taken from two different experience rating plans:"]
[{"$f":"INDEX('Point Grid'!B:B,MATCH('7'!A1,'Point Grid'!A:A,0))","v":3}]
[null,null,"Experience Modification",null,"Experience Data"]
[null,"Insured","Plan A","Plan B","Manual Premium","Losses"]
[null,1,0.8,1.03,{"v":75000,"d":"75,000"},{"v":60000,"d":"60,000"}]
[null,2,0.85,0.69,{"v":75000,"d":"75,000"},{"v":58000,"d":"58,000"}]
[null,3,{"v":0.9,"d":"0.90"},0.75,{"v":75000,"d":"75,000"},{"v":61000,"d":"61,000"}]
[null,4,0.91,0.89,{"v":125000,"d":"125,000"},{"v":104000,"d":"104,000"}]
[null,5,0.96,0.87,{"v":125000,"d":"125,000"},{"v":116000,"d":"116,000"}]
[]
["(a)","Demonstrate whether Plan A or Plan B appears to be more equitable."]
[{"$f":"INDEX('Point Grid'!$C$8:$I$28,MATCH($A$1,'Point Grid'!$A$8:$A$28,0),MATCH(A13,'Point Grid'!$C$7:$I$7,0))","v":2.5}]
[]
{"$rows_left_out":6}
{"sheet":"8","index":10,"n_rows":35,"n_cols":7,"rows_kept":35}
[8,"Incomplete",null,null,"Navigator",null,"Solution"]
[{"$nulls":5},"a.)"]
["Points","A portfolio of insurance policies currently has the size of loss distribution shown below:"]
[{"$f":"INDEX('Point Grid'!B:B,MATCH('8'!A1,'Point Grid'!A:A,0))","v":3.5},"Occurrence Limit","Probability that a Claim is less than the Occurrence Limit","Expected Limited Severity for the Occurrence Limit"]
[null,{"v":100000,"d":"100,000"},{"v":0.673,"d":"67.3%"},{"v":48000,"d":"$48,000"}]
[null,{"v":125000,"d":"125,000"},{"v":0.689,"d":"68.9%"},{"v":59000,"d":"$59,000"}]
[null,{"v":150000,"d":"150,000"},{"v":0.712,"d":"71.2%"},{"v":63500,"d":"$63,500"}]
[null,{"v":175000,"d":"175,000"},{"v":0.712,"d":"71.2%"},{"v":68000,"d":"$68,000"}]
[null,{"v":200000,"d":"200,000"},{"v":0.818,"d":"81.8%"},{"v":73500,"d":"$73,500"}]
[null,{"v":225000,"d":"225,000"},{"v":0.819,"d":"81.9%"},{"v":90500,"d":"$90,500"}]
[null,{"v":250000,"d":"250,000"},{"v":0.864,"d":"86.4%"},{"v":120000,"d":"$120,000"}]
[null,{"v":300000,"d":"300,000"},{"v":0.884,"d":"88.4%"},{"v":123000,"d":"$123,000"}]
[null,{"v":400000,"d":"400,000"},{"v":0.895,"d":"89.5%"},{"v":124000,"d":"$124,000"}]
[null,{"v":500000,"d":"500,000"},{"v":0.903,"d":"90.3%"},{"v":130500,"d":"$130,500"}]
[null,{"v":750000,"d":"750,000"},{"v":0.903,"d":"90.3%"},{"v":135000,"d":"$135,000"}]
{"$rows_left_out":21}
{"sheet":"9","index":11,"n_rows":54,"n_cols":11,"rows_kept":54,"merged":[[0,7,0,8]]}
[9,"Incomplete",{"$nulls":5},"Navigator",null,null,"Solution"]
[{"$nulls":9},"a.)"]
["Points","Consider the following loss experience as of June 30, 2021 under a claims-made commercial general"]
[{"$f":"INDEX('Point Grid'!B:B,MATCH('9'!A1,'Point Grid'!A:A,0))","v":4},"liability policy:"]
[]
[null,"Policy Year","Claim Number","Basic Limit Indemnity","ALAE"]
[null,2016,1,{"v":25000,"d":"$25,000"},{"v":1000,"d":"$1,000"}]
[null,2017,2,{"v":8500,"d":"$8,500"},{"v":0,"d":"$0"}]
[null,2018,3,{"v":100000,"d":"$100,000"},{"v":55000,"d":"$55,000"}]
[null,2018,4,{"v":55000,"d":"$55,000"},{"v":5000,"d":"$5,000"}]
[null,2020,5,{"v":0,"d":"$0"},{"v":150000,"d":"$150,000"}]
[null,2020,6,{"v":32000,"d":"$32,000"},{"v":800,"d":"$800"}]
[]
[null,"The policy being rated has the following characteristics:"]
[null,"   • The policy always runs from January 1st through December 31st each year."]
{"$rows_left_out":40}
{"sheet":"10","index":12,"n_rows":19,"n_cols":8,"rows_kept":19}
[10,"Incomplete",{"$nulls":3},"Navigator",null,"Solution"]
[{"$nulls":6},"a.)"]
["Points","Answer the following in the context of the NCCI experience rating formula."]
[{"$f":"INDEX('Point Grid'!B:B,MATCH('10'!A1,'Point Grid'!A:A,0))","v":1.75}]
[]
["(a)","Explain why splitting the formula into primary and excess components is"]
[{"$f":"INDEX('Point Grid'!$C$8:$I$28,MATCH($A$1,'Point Grid'!$A$8:$A$28,0),MATCH(A6,'Point Grid'!$C$7:$I$7,0))","v":0.5},"preferable for Workers' Compensation risks."]
[]
[]
["(b)","Briefly describe the function of the primary component of the formula."]
[{"$f":"INDEX('Point Grid'!$C$8:$I$28,MATCH($A$1,'Point Grid'!$A$8:$A$28,0),MATCH(A10,'Point Grid'!$C$7:$I$7,0))","v":0.25}]
[]
[]
["(c)","Briefly describe why the excess component is capped."]
[{"$f":"INDEX('Point Grid'!$C$8:$I$28,MATCH($A$1,'Point Grid'!$A$8:$A$28,0),MATCH(A14,'Point Grid'!$C$7:$I$7,0))","v":0.25}]
{"$rows_left_out":5}
{"sheet":"11","index":13,"n_rows":30,"n_cols":9,"rows_kept":30}
[11,"Incomplete",{"$nulls":4},"Navigator",null,"Solution"]
[{"$nulls":7},"a.)"]
["Points"]
[{"$f":"INDEX('Point Grid'!B:B,MATCH('11'!A1,'Point Grid'!A:A,0))","v":2.75},"ABC Incorporated is a theme park operator who is purchasing a Commercial General Liability "]
[null,"policy with an effective date of January 1, 2022. Assume ABC Incorporated is eligible for both "]
[null,"experience and schedule rating, and each scenario listed below is independent."]
[]
[null,"For each scenario identify whether a debit or credit should apply to the schedule rating,"]
[null,"suggest an appropriate figure and state the maximum possible debit or credit that could"]
[null,"be applied."]
[]
["(a)","In 2017, ABC Incorporated implemented a mandatory one-month training program for all"]
[{"$f":"INDEX('Point Grid'!$C$8:$I$28,MATCH($A$1,'Point Grid'!$A$8:$A$28,0),MATCH(A12,'Point Grid'!$C$7:$I$7,0))","v":0.5},"new hires that teaches equipment maintenance, safety programs, and first aid."]
[]
[]
{"$rows_left_out":16}
{"sheet":"12","index":14,"n_rows":20,"n_cols":9,"rows_kept":20}
[12,"Incomplete",{"$nulls":4},"Navigator",null,"Solution"]
[{"$nulls":7},"a.)"]
["Points"]
[{"$f":"INDEX('Point Grid'!B:B,MATCH('12'!A1,'Point Grid'!A:A,0))","v":3}]
[]
["(a)","Using words, identify the three criteria that define an effective credibility function "]
[{"$f":"INDEX('Point Grid'!$C$8:$I$28,MATCH($A$1,'Point Grid'!$A$8:$A$28,0),MATCH(A6,'Point Grid'!$C$7:$I$7,0))","v":1},"for experience rating."]
[]
[]
["(b)","Using equations, describe the three criteria from part (a), making sure to "]
[{"$f":"INDEX('Point Grid'!$C$8:$I$28,MATCH($A$1,'Point Grid'!$A$8:$A$28,0),MATCH(A10,'Point Grid'!$C$7:$I$7,0))","v":1},"define all notation used."]
[]
[]
["(c)","For each of the three criteria, briefly explain whether or not the following credibility function "]
[{"$f":"INDEX('Point Grid'!$C$8:$I$28,MATCH($A$1,'Point Grid'!$A$8:$A$28,0),MATCH(A14,'Point Grid'!$C$7:$I$7,0))","v":1},"satisfies the criterion."]
{"$rows_left_out":6}
{"sheet":"13","index":15,"n_rows":28,"n_cols":9,"rows_kept":28}
[13,"Incomplete",{"$nulls":4},"Navigator",null,"Solution"]
[{"$nulls":7},"a.)"]
["Points","The following information applies to a balanced retrospectively rated policy:"]
[{"$f":"INDEX('Point Grid'!B:B,MATCH('13'!A1,'Point Grid'!A:A,0))","v":2}]
[null,{"v":26000,"d":"$26,000"},"Standard Premium"]
[null,{"v":24000,"d":"$24,000"},"Guaranteed Cost Premium"]
[null,{"v":20000,"d":"$20,000"},"Provision for Losses and Expenses excluding Taxes"]
[null,{"v":15000,"d":"$15,000"},"Expected Losses"]
[null,1.15,"Loss Conversion Factor"]
[null,0.06,"Charge for Maximum"]
[null,0.57,"Savings for Maximum"]
[null,0.685,"Charge for Minimum"]
[null,0.019,"Savings for Minimum"]
[]
["(a)","Determine the tax multiplier."]
{"$rows_left_out":14}
{"sheet":"14","index":16,"n_rows":11,"n_cols":7,"rows_kept":11}
[14,"Incomplete",null,null,"Navigator",null,"Solution"]
[{"$nulls":5},"a.)"]
["Points","Using the information below, calculate the premium for a $50,000 deductible policy."]
[{"$f":"INDEX('Point Grid'!B:B,MATCH('14'!A1,'Point Grid'!A:A,0))","v":2}]
[null,{"v":314200,"d":"$314,200"},"Standard Premium"]
["(a)",{"v":0.65,"d":"65%"},"Expected Loss ratio"]
[{"$f":"INDEX('Point Grid'!$C$8:$I$28,MATCH($A$1,'Point Grid'!$A$8:$A$28,0),MATCH(A6,'Point Grid'!$C$7:$I$7,0))","v":2},{"v":0.1,"d":"10%"},"ALAE as a percentage of loss"]
[null,{"v":0.175,"d":"18%"},"Commission as a percentage of premium"]
[null,{"v":0.08,"d":"8%"},"Other variable expenses"]
[null,{"v":22000,"d":"$22,000"},"Fixed expenses"]
[null,0.32,"Loss Elimination Ratio at a $50,000 deductible"]

{"sheet":"15","index":17,"n_rows":29,"n_cols":9,"rows_kept":29,"merged":[[17,2,17,3],[18,2,18,3],[19,2,19,3],[20,2,20,3],[21,2,21,3]]}
[15,"Incomplete",{"$nulls":4},"Navigator",null,"Solution"]
[{"$nulls":7},"a.)"]
["Points","An insurer writes five identical workers compensation risks for one year and observes "]
[{"$f":"INDEX('Point Grid'!B:B,MATCH('15'!A1,'Point Grid'!A:A,0))","v":4},"the following:"]
[]
[null,{"v":1250000,"d":"$1,250,000"},"Standard Premium for each risk"]
[null,{"v":0.06,"d":"6%"},"General Overhead Expense as a Percent of Standard Premium"]
[null,{"v":0.045,"d":"4.50%"},"Credit Risk Charge as a Percent of Standard Premium"]
[null,{"v":0.11,"d":"11%"},"Expected ULAE as a Percent of Loss and ALAE"]
[null,{"v":0.04,"d":"4%"},"Loss Based Assessment as a Percent of Loss and ALAE"]
[null,{"v":0.1,"d":"10%"},"Excess Ratio for a $250,000 Deductible (% of Loss and ALAE)"]
[null,{"v":0.08,"d":"8%"},"Acquisition Expenses as a Percent of Standard Premium"]
[null,{"v":0.03,"d":"3%"},"Premium Tax as a Percent of Standard Premium"]
[null,{"v":0.05,"d":"5%"},"Profit Load as a Percent of Net Premium"]
[]
{"$rows_left_out":15}
{"sheet":"16","index":18,"n_rows":20,"n_cols":9,"rows_kept":20}
[16,"Incomplete",{"$nulls":4},"Navigator",null,"Solution"]
[{"$nulls":7},"a.)"]
["Points","The following information applies to a company's retrospectively rated Workers'"]
[{"$f":"INDEX('Point Grid'!B:B,MATCH('16'!A1,'Point Grid'!A:A,0))","v":4},"Compensation policy:"]
[null,"   • Its losses are expected to be uniformly distributed on [0, 1,000,000]."]
[]
[null,{"v":750000,"d":"$750,000"},"Losses at maximum premium"]
[null,{"v":225000,"d":"$225,000"},"Losses at minimum premium"]
[null,1.15,"Loss conversion factor"]
[null,{"v":130000,"d":"$130,000"},"Basic Premium"]
[null,{"v":0.05,"d":"5%"},"Tax Rate"]
[]
["(a)","Calculate the expected retrospective premium for this Workers' Compensation policy."]
[{"$f":"INDEX('Point Grid'!$C$8:$I$28,MATCH($A$1,'Point Grid'!$A$8:$A$28,0),MATCH(A13,'Point Grid'!$C$7:$I$7,0))","v":2}]
[]
{"$rows_left_out":6}
{"sheet":"17","index":19,"n_rows":16,"n_cols":9,"rows_kept":16}
[17,"Incomplete",{"$nulls":4},"Navigator",null,"Solution"]
[{"$nulls":7},"a.)"]
["Points","Given the following information about an insurer's book of business:"]
[{"$f":"INDEX('Point Grid'!B:B,MATCH('17'!A1,'Point Grid'!A:A,0))","v":1.5}]
[null,{"v":10000,"d":"$10,000"},"Basic limit",null,"Claim Size","Probability"]
[null,{"v":250000,"d":"$250,000"},"Policy limit",null,{"v":250,"d":"$250"},0.1768]
[null,{"v":500,"d":"$500"},"Average ALAE",null,{"v":2500,"d":"$2,500"},0.5709]
[null,{"v":0.02,"d":"2.0%"},"ULAE",null,{"v":15000,"d":"$15,000"},0.1565]
[null,{"v":4,"d":"4.0"},"Expected Claim Count",null,{"v":75000,"d":"$75,000"},0.0958]
[null,{"v":0.15,"d":"15.0%"},"ISO k-value"]
[]
[null,"• Claim counts are assumed to follow a Poisson distribution."]
[null,"• The insurer follows the ISO approach to load their ILFs for risk."]
[]
["(a)","Calculate the ILF at the policy limit with and without including the risk load."]
{"$rows_left_out":2}
{"sheet":"18","index":20,"n_rows":47,"n_cols":10,"rows_kept":47,"merged":[[0,6,0,7]]}
[18,"Incomplete",{"$nulls":4},"Navigator",null,null,"Solution"]
[{"$nulls":8},"a.)"]
["Points","An insured is subject to experience rating under the National Council on Compensation Insurance "]
[{"$f":"INDEX('Point Grid'!B:B,MATCH('18'!A1,'Point Grid'!A:A,0))","v":3},"(NCCI) Experience Rating Plan Manual for Workers Compensation and Employers Liability Insurance."]
[]
[null,"The following information about the insured is given:"]
[null,{"v":4000000,"d":"$4,000,000"},"Payroll for the experience period"]
[null,"AL","State"]
[null,4279,"Class"]
[null,{"v":5000,"d":"$5,000"},"Primary/Excess split point"]
[null,{"v":167000,"d":"$167,000"},"State per Claim Accident Limitation"]
[null,{"v":334000,"d":"$334,000"},"State Multiple Claim Accident Limitation"]
[null,{"v":6.7,"d":"6.70"},"G value"]
[]
[null,"The following claims apply to the experience period."]
{"$rows_left_out":33}
{"sheet":"19","index":21,"n_rows":30,"n_cols":11,"rows_kept":30}
[19,"Incomplete",{"$nulls":6},"Navigator",null,"Solution"]
[{"$nulls":9},"a.)"]
["Points"]
[{"$f":"INDEX('Point Grid'!B:B,MATCH('19'!A1,'Point Grid'!A:A,0))","v":2.5},"Given the following information about an insurer's book of business which "]
[null,"utilizes straight deductibles:"]
[]
[null,0.0003,"Ground-up claim frequency"]
[null,{"v":100000,"d":"100,000"},"Basic policy limit"]
[null,{"v":12310,"d":"12,310"},"Basic limit expected loss"]
[null,150,"ALAE"]
[null,{"v":0.12,"d":"12.0%"},"ULAE"]
[]
[null,{"v":250000,"d":"$250,000"},"Policy limit"]
[null,{"v":1000,"d":"$1,000"},"Policy Deductible"]
[null,{"v":4684.152990107914,"d":"$4,684"},"Policy Premium"]
{"$rows_left_out":16}
{"sheet":"20","index":22,"n_rows":37,"n_cols":12,"rows_kept":37,"merged":[[0,8,0,9]]}
[20,"Incomplete",{"$nulls":6},"Navigator",null,null,"Solution"]
[{"$nulls":10},"a.)"]
["Points","Given the following information about a retrospectively rated Workers' Compensation policy which is"]
[{"$f":"INDEX('Point Grid'!B:B,MATCH('20'!A1,'Point Grid'!A:A,0))","v":2.5},"also subject to experience rating."]
[]
[null,0.95,"Experience Modification Factor",{"$nulls":4},"Table of Policy Excess Ratio Ranges"]
[null,{"v":0.66,"d":"66%"},"Expected Unlimited Loss Ratio",{"$nulls":4},"Sub-table","Excess Ratio Range"]
[{"$nulls":7},7,"0.146 - 0.181"]
[null,null,"Hazard","Manual","Excess Ratio ","Avg. Cost",null,8,"0.182 - 0.221"]
[null,"State","Group","Premium","at Loss Limit","per Case",null,9,"0.222 - 0.269"]
[null,"X","A",{"v":70000,"d":"70,000"},0.72,{"v":25000,"d":"25,000"},null,10,"0.270 - 0.316"]
[null,"Y","B",{"v":120000,"d":"120,000"},0.05,{"v":17000,"d":"17,000"},null,11,"0.317 - 0.358"]
[null,"Z","C",{"v":135000,"d":"135,000"},0.59,{"v":20000,"d":"20,000"},null,12,"0.359 - 0.420"]
[{"$nulls":7},13,"0.421 - 0.484"]
[]
{"$rows_left_out":17}
{"sheet":"21","index":23,"n_rows":24,"n_cols":10,"rows_kept":24}
[21,"Incomplete",{"$nulls":5},"Navigator",null,"Solution"]
[{"$nulls":8},"a.)"]
["Points","An actuary wishes to fit a claim size distribution to a sample of 1,000 claims."]
[{"$f":"INDEX('Point Grid'!B:B,MATCH('21'!A1,'Point Grid'!A:A,0))","v":2.25}]
[null,null,"Size Group","# Claims","Total Loss","Severity"]
[null,null,"0 – 100",99,{"v":5000,"d":"5,000"},{"$f":"E6/D6","v":{"v":50.505050505050505,"d":"51"}}]
[null,null,"101 – 500",293,{"v":84000,"d":"84,000"},{"$f":"E7/D7","v":{"v":286.68941979522185,"d":"287"}}]
[null,null,"501 – 1,000",221,{"v":162000,"d":"162,000"},{"v":733.0316742081448,"d":"733"}]
[null,null,"1,001 – 2,000",213,{"v":305000,"d":"305,000"},{"v":1431.924882629108,"d":"1,432"}]
[null,null,"2,001 – 4,000",127,{"v":354000,"d":"354,000"},{"v":2787.4015748031497,"d":"2,787"}]
[null,null,"4,001 – 5,000",20,{"v":91000,"d":"91,000"},{"v":4550,"d":"4,550"}]
[null,null,"5,001 – 10,000",27,{"v":193000,"d":"193,000"},{"v":7148.148148148148,"d":"7,148"}]
[null,null,"Total",{"$f":"SUM(D6:D12)","v":{"v":1000,"d":"1,000"}},{"$f":"SUM(E6:E12)","v":{"v":1194000,"d":"1,194,000"}},{"$f":"E13/D13","v":{"v":1194,"d":"1,194"}}]
[]
["(a)","Calculate the empirical mean excess claim size distribution and identify the distribution."]
{"$rows_left_out":10}
{"sheet":"22","index":24,"n_rows":40,"n_cols":9,"rows_kept":40,"merged":[[0,5,0,6]]}
[22,"Incomplete",{"$nulls":3},"Navigator",null,null,"Solution"]
[{"$nulls":7},"b.)"]
["Points","An actuary is about to peer review a GLM. They are refreshing their memory on some model"]
[{"$f":"INDEX('Point Grid'!B:B,MATCH('22'!A1,'Point Grid'!A:A,0))","v":1.75},"refinement techniques."]
[]
[]
["(a)","Match the following descriptions to the correct techniques."]
[{"$f":"INDEX('Point Grid'!$C$8:$I$29,MATCH($A$1,'Point Grid'!$A$8:$A$29,0),MATCH(A7,'Point Grid'!$C$7:$I$7,0))","v":0.75}]
[null,"Cook's distance"]
[]
[]
[null,"Cross validation"]
[]
[]
[null,"Bootstrapping"]
{"$rows_left_out":15}
{"sheet":"23","index":25,"n_rows":24,"n_cols":10,"rows_kept":24,"merged":[[0,6,0,7]]}
[23,"Incomplete",{"$nulls":4},"Navigator",null,null,"Solution"]
[]
["Points","An actuary has built a GLM for a countrywide rating plan. "]
[{"$f":"INDEX('Point Grid'!B:B,MATCH('23'!A1,'Point Grid'!A:A,0))","v":2},"They are using a lasso credibility model with a log-link function to produce"]
[null,"a rating plan for one of their mid-size states."]
[null,"The actuary uses the relativities from the countrywide GLM as the offsets."]
[]
["(a)","Using the information below, construct the table of rating factors for"]
[{"$f":"INDEX('Point Grid'!$C$8:$I$30,MATCH($A$1,'Point Grid'!$A$8:$A$30,0),MATCH(A8,'Point Grid'!$C$7:$I$7,0))","v":0.5},"the VehicleType rating variable for the mid-size state."]
[]
[{"$nulls":3},"GLM",null,"βj","Mid-Size"]
[null,"VehicleType",null,"Relativity",null,"Coefficients","Exposures"]
[null,"Sedan",null,{"v":1,"d":"1.000"},null,{"v":0,"d":"0.0000"},{"v":250000,"d":"250,000"}]
[null,"Van",null,0.691,null,0.2187,{"v":15000,"d":"15,000"}]
[null,"SUV",null,1.187,null,-0.0631,{"v":140000,"d":"140,000"}]
{"$rows_left_out":9}