{"text_format":"3","workbook":"xlsx","n_sheets":24,"sheets":["Instructions","Point Grid","Navigator","1","2","3","4","5","6","7","8","9","10","11","12","13","14","15","16","17","18","19","20","21"],"not_rendered":{"charts":1,"images":2},"read":"whole","date_system":"1900"}

{"sheet":"Instructions","index":0,"n_rows":32,"n_cols":1,"rows_kept":32}
[]
[]
[]
[]
[]
["Instructions"]
{"$rows_left_out":27}
{"sheet":"Point Grid","index":1,"n_rows":32,"n_cols":19,"rows_kept":32,"merged":[[5,1,6,1]]}
[]
[]
[]
[]
["Practice Exam 2 – Exam 8"]
[null,"Total Point Value","Sub-Part of Question",{"$nulls":8},"Your Score","Sub-Part of Question"]
{"$rows_left_out":27}
{"sheet":"Navigator","index":2,"n_rows":29,"n_cols":8,"rows_kept":29,"merged":[[8,0,8,6],[9,0,9,6],[10,0,10,6],[11,0,11,6],[12,0,12,6],[13,0,13,6],[14,0,14,6],[15,0,15,6],[16,0,16,6],[17,0,17,6],[18,0,18,6],[19,0,19,6],[20,0,20,6],[21,0,21,6],[22,0,22,6],[23,0,23,6],[24,0,24,6],[25,0,25,6],[26,0,26,6],[27,0,27,6],[28,0,28,6]]}
[]
[]
[]
[]
[]
["Navigator – Select a question to go to it"]
{"$rows_left_out":24}
{"sheet":"1","index":3,"n_rows":70,"n_cols":14,"rows_kept":70,"merged":[[0,6,0,7]]}
[{"$f":"VALUE(MID(CELL(\"filename\",A1),FIND(\"]\",CELL(\"filename\",A1))+1,LEN(CELL(\"filename\",A1))-FIND(\"]\",CELL(\"filename\",A1))+1))","v":1},"Finished",{"$nulls":4},"Navigator",null,null,"Solution"]
[{"$nulls":8},"a.)","Observe the book of business has grown rapidly over time. We need to account for this by working on a per-exposure basis."]
["Points","A State Regulator is reviewing a Homeowners rate filing made by XYZ Insuance Company (XYZ)."]
[{"$f":"INDEX('Point Grid'!B:B,MATCH('1'!A1,'Point Grid'!A:A,0))","v":5.75},"XYZ provided 15 years of historical data as of 12/31/2022 in support of their catastrophe provision:",{"$nulls":7},"First calculate the ratio of catastrophe losses to non-catastrophe losses"]
[{"$nulls":9},"Year","NC / EE","Actual Cat/EE","Expected Cat/EE","(A-E)^2/E"]
[null,"Accident","Earned","Case Incurred Loss and DCC ($000)",{"$nulls":5},{"$f":"B8","v":2007},{"$f":"E8/C8","v":{"v":5.4209919261822375,"d":"5.421"}},{"$f":"D8/C8","v":{"v":0,"d":"0.000"}},{"$f":"K6*($B$26-1)","v":{"v":4.708939436518076,"d":"4.709"}},{"$f":"(L6-M6)^2/M6","v":{"v":4.708939436518076,"d":"4.709"}}]
{"$rows_left_out":65}
{"sheet":"2","index":4,"n_rows":34,"n_cols":14,"rows_kept":34,"merged":[[0,6,0,7]]}
[{"$f":"VALUE(MID(CELL(\"filename\",A1),FIND(\"]\",CELL(\"filename\",A1))+1,LEN(CELL(\"filename\",A1))-FIND(\"]\",CELL(\"filename\",A1))+1))","v":2},"Finished",{"$nulls":4},"Navigator",null,null,"Solution"]
[{"$nulls":8},"a.)","The analyst should separately estimate the relativities for the territories and deductibles and then"]
["Points","An analyst is building a generalized linear model for a rating plan. The new plan",{"$nulls":7},"include them in the GLM via offset terms."]
[{"$f":"INDEX('Point Grid'!B:B,MATCH('2'!A1,'Point Grid'!A:A,0))","v":2.75},"will include the territory and deductible relativities from their existing  rating plan.",{"$nulls":7},"The analyst should do this for territory because there may be too many territories to realistically consider"]
[{"$nulls":9},"the territory data to be fully credible which is a core assumption when modeling with GLMs."]
["(a)","Briefly describe how the analyst should incorporate territory and deductible into",{"$nulls":7},"The analyst should do this for deductibles because GLMs often produce counterintuitive results when modeling"]
{"$rows_left_out":29}
{"sheet":"3","index":5,"n_rows":21,"n_cols":12,"rows_kept":21,"merged":[[0,7,0,8]]}
[{"$f":"VALUE(MID(CELL(\"filename\",A1),FIND(\"]\",CELL(\"filename\",A1))+1,LEN(CELL(\"filename\",A1))-FIND(\"]\",CELL(\"filename\",A1))+1))","v":3},"Finished",{"$nulls":5},"Navigator",null,null,"Solution"]
[{"$nulls":9},"a.)","AIC = -2*log-likelihood + 2p where p is the number of parameters."]
["Points","You are given the following table for model selection:",{"$nulls":8},"The intercept is a single parameter and so the Age variable contributes 4 parameters."]
[{"$f":"INDEX('Point Grid'!B:B,MATCH('3'!A1,'Point Grid'!A:A,0))","v":2.5},{"$nulls":9},"Similarly, there are 10 parameters for the Vehicle Body variable."]
[{"$nulls":6},"Number of"]
[null,"Model",{"$nulls":3},"-2*ll","Parameters","AIC",null,null,"Using the first line we get"]
{"$rows_left_out":16}
{"sheet":"4","index":6,"n_rows":37,"n_cols":12,"rows_kept":37,"merged":[[0,6,0,7]]}
[{"$f":"VALUE(MID(CELL(\"filename\",A1),FIND(\"]\",CELL(\"filename\",A1))+1,LEN(CELL(\"filename\",A1))-FIND(\"]\",CELL(\"filename\",A1))+1))","v":4},"Finished",{"$nulls":4},"Navigator",null,null,"Solution"]
[{"$nulls":8},"a.)"]
["Points","You are given the following information for a fitted GLM:"]
[{"$f":"INDEX('Point Grid'!B:B,MATCH('4'!A1,'Point Grid'!A:A,0))","v":2}]
[null,"Response variable","Occurrence of Accidents"]
[null,"Response distribution","Binomial"]
{"$rows_left_out":32}
{"sheet":"5","index":7,"n_rows":44,"n_cols":14,"rows_kept":44,"merged":[[0,5,0,6]]}
[{"$f":"VALUE(MID(CELL(\"filename\",A1),FIND(\"]\",CELL(\"filename\",A1))+1,LEN(CELL(\"filename\",A1))-FIND(\"]\",CELL(\"filename\",A1))+1))","v":5},"Finished",{"$nulls":3},"Navigator",null,null,"Solution"]
[{"$nulls":7},"a.)","Estimated claim severity for electric vehicles that are trucks and drive 30 miles per day:"]
["Points","An actuary is working on a usage based insurance (UBI) program for a state's Private Passenger",{"$nulls":6},"ln(u) =",{"$f":"D17+D18+D20+LN(D27/20)*D21+LN(D27/20)*D22","v":9.472424822554073}]
[{"$f":"INDEX('Point Grid'!B:B,MATCH('5'!A1,'Point Grid'!A:A,0))","v":4.25},"Automobile market. They create a generalized linear model (GLM) to predict claim severity",{"$nulls":6},"u =",{"$f":"EXP(J3)","v":{"v":12996.36292831051,"d":"12,996"}}]
[null,"by Daily Miles Driven (DMD), Vehicle Type, and Electric Vehicle Ind (EVInd)."]
[{"$nulls":8},"Estimated claim severity for non-electric vehicles that are trucks and drive 30 miles per day:"]
{"$rows_left_out":39}
{"sheet":"6","index":8,"n_rows":80,"n_cols":21,"rows_kept":80,"merged":[[0,11,0,12]]}
[{"$f":"VALUE(MID(CELL(\"filename\",A1),FIND(\"]\",CELL(\"filename\",A1))+1,LEN(CELL(\"filename\",A1))-FIND(\"]\",CELL(\"filename\",A1))+1))","v":6},"Finished",{"$nulls":9},"Navigator",null,null,"Solution"]
[{"$nulls":13},"a.)","First convert the given table into ratios of claims to TT claims."]
["Points","An actuary has collected the following claim count data for Workers' Compensation claims.",{"$nulls":13},"Year 1",null,"Year 2",null,"Total"]
[{"$f":"INDEX('Point Grid'!B:B,MATCH('6'!A1,'Point Grid'!A:A,0))","v":4.75},"The only injury types are Fatal, Major, and Temporary Total (TT).",{"$nulls":12},"Class","Fatal","Major","Fatal","Major","Fatal","Major"]
[null,"The classes below are the only classes the company writes in Hazard Group F.",{"$nulls":12},1,{"$f":"C9/$E9","v":{"v":2.4096385542168677E-3,"d":"0.0024"}},{"v":0.03132530120481928,"d":"0.0313"},{"$f":"F9/$H9","v":{"v":0.047619047619047616,"d":"0.0476"}},{"v":0.16071428571428573,"d":"0.1607"},{"$f":"I9/$K9","v":{"v":0.015437392795883362,"d":"0.0154"}},{"v":0.0686106346483705,"d":"0.0686"}]
[{"$nulls":14},2,{"v":0.024489795918367346,"d":"0.0245"},{"v":0.07346938775510205,"d":"0.0735"},{"v":0.04390243902439024,"d":"0.0439"},{"v":0.07317073170731707,"d":"0.0732"},{"v":0.03333333333333333,"d":"0.0333"},{"v":0.07333333333333333,"d":"0.0733"}]
{"$rows_left_out":75}
{"sheet":"7","index":9,"n_rows":48,"n_cols":25,"rows_kept":48,"merged":[[0,10,0,11],[42,2,43,2],[44,2,45,2],[46,2,47,2]]}
[{"$f":"VALUE(MID(CELL(\"filename\",A1),FIND(\"]\",CELL(\"filename\",A1))+1,LEN(CELL(\"filename\",A1))-FIND(\"]\",CELL(\"filename\",A1))+1))","v":7},"Finished",{"$nulls":8},"Navigator",null,null,"Solution"]
[{"$nulls":12},"a.)","The company has experienced rapid growth in gross annual sales. Therefore, there has been a dramatic shift"]
["Points","The following policy is being rated using the ISO CGL rating plan.",{"$nulls":11},"in exposures so it is not appropriate to use the standard approach."]
[{"$f":"INDEX('Point Grid'!B:B,MATCH(A1,'Point Grid'!A:A,0))","v":2.75},{"$nulls":5},"Current Company Rates per Exposure",{"$nulls":6},"We cannot use the Present Average Company Rates approach because we lack information about the"]
[null,{"$f":"DATE(YEAR(TODAY()),12,1)","v":"2025-12-01"},"Effective Date",{"$nulls":3},"Policy Type","Sub-line","Rate",{"$nulls":4},"company's annual basic limits premium."]
[null,"Claims-Made (CM)","Policy Type",{"$nulls":3},"3rd-yr CM","Prem/Ops",7.7]
{"$rows_left_out":43}
{"sheet":"8","index":10,"n_rows":35,"n_cols":18,"rows_kept":35,"merged":[[0,5,0,6]]}
[{"$f":"VALUE(MID(CELL(\"filename\",A1),FIND(\"]\",CELL(\"filename\",A1))+1,LEN(CELL(\"filename\",A1))-FIND(\"]\",CELL(\"filename\",A1))+1))","v":8},"Finished",{"$nulls":3},"Navigator",null,null,"Solution"]
[{"$nulls":7},"a.)","Apply the quintiles test. Group the insureds into five groups, ordered by increasing experience mod."]
["Points","The following information was taken from two different experience rating plans:",{"$nulls":6},"Use weighted manual and standard loss ratios."]
[{"$f":"INDEX('Point Grid'!B:B,MATCH('8'!A1,'Point Grid'!A:A,0))","v":3.5},null,"Experience Mod",null,"Experience Data",{"$nulls":8},"Weighted Average Mods",null,null,"Standard Loss Ratios"]
[null,"Insured","Plan A","Plan B","Manual Premium ($)","Losses ($)",null,null,"Quintile","Contains",null,"Manual Premium","Losses","Plan A","Plan B","Manual LR","Plan A","Plan B"]
[null,1,0.62,0.66,{"v":100000,"d":"100,000"},{"v":65000,"d":"65,000"},null,null,"A",1,2,{"$f":"SUMIFS($E$6:$E$15,$B$6:$B$15,J6)+SUMIFS($E$6:$E$15,$B$6:$B$15,K6)","v":{"v":180000,"d":"180,000"}},{"$f":"SUMIFS($F$6:$F$15,$B$6:$B$15,J6)+SUMIFS($F$6:$F$15,$B$6:$B$15,K6)","v":{"v":145000,"d":"145,000"}},{"$f":"(SUMIFS($E$6:$E$15,$B$6:$B$15,J6)*SUMIFS($C$6:$C$15,$B$6:$B$15,J6)+SUMIFS($E$6:$E$15,$B$6:$B$15,K6)*SUMIFS($C$6:$C$15,$B$6:$B$15,K6))/(SUMIFS($E$6:$E$15,$B$6:$B$15,J6)+SUMIFS($E$6:$E$15,$B$6:$B$15,K6))","v":{"v":0.6866666666666666,"d":"0.687"}},{"$f":"(SUMIFS($E$6:$E$15,$B$6:$B$15,J6)*SUMIFS($D$6:$D$15,$B$6:$B$15,J6)+SUMIFS($E$6:$E$15,$B$6:$B$15,K6)*SUMIFS($D$6:$D$15,$B$6:$B$15,K6))/(SUMIFS($E$6:$E$15,$B$6:$B$15,J6)+SUMIFS($E$6:$E$15,$B$6:$B$15,K6))","v":{"v":0.7266666666666667,"d":"0.727"}},{"$f":"M6/L6","v":{"v":0.8055555555555556,"d":"0.806"}},{"$f":"M6/(N6*L6)","v":{"v":1.1731391585760518,"d":"1.173"}},{"$f":"M6/(O6*L6)","v":{"v":1.1085626911314985,"d":"1.109"}}]
{"$rows_left_out":30}
{"sheet":"9","index":11,"n_rows":29,"n_cols":9,"rows_kept":29,"merged":[[0,5,0,6]]}
[{"$f":"VALUE(MID(CELL(\"filename\",A1),FIND(\"]\",CELL(\"filename\",A1))+1,LEN(CELL(\"filename\",A1))-FIND(\"]\",CELL(\"filename\",A1))+1))","v":9},"Finished",{"$nulls":3},"Navigator",null,null,"Solution"]
[{"$nulls":7},"a.)","Two goals of experience rating are:"]
["Points",{"$nulls":7},"1. Provide an incentive for safety improvements."]
[{"$f":"INDEX('Point Grid'!B:B,MATCH('9'!A1,'Point Grid'!A:A,0))","v":3.5},{"$nulls":7},"2. Increase rating equitability by charging rates which better reflect risk."]
[]
["(a)","Identify and explain two goals of experience rating.",{"$nulls":5},"b.)","The experience period is January 1, 2017 through January 1, 2019."]
{"$rows_left_out":24}
{"sheet":"10","index":12,"n_rows":66,"n_cols":15,"rows_kept":66,"merged":[[0,6,0,7]]}
[{"$f":"VALUE(MID(CELL(\"filename\",A1),FIND(\"]\",CELL(\"filename\",A1))+1,LEN(CELL(\"filename\",A1))-FIND(\"]\",CELL(\"filename\",A1))+1))","v":10},"Finished",{"$nulls":4},"Navigator",null,null,"Solution"]
[{"$nulls":8},"a.)","The experience period is January 1, 2019 – January 1, 2021."]
["Points","Both Employer A and Employer B want to purchase Workers' Compensation insurance in Alabama.",{"$nulls":7},"We need either the sum of the latest two years in the experience period to exceed the Column A value, or"]
[{"$f":"INDEX('Point Grid'!B:B,MATCH('10'!A1,'Point Grid'!A:A,0))","v":5.5},"The effective date is January 1, 2023 for each policy. The following information applies:",{"$nulls":7},"the average of the three years to exceed the Column B value."]
[]
[null,"Policy Effective Date","Months of Data","Subject Premium",{"$nulls":5},"Employer","Latest 2","3-yr Avg"]
{"$rows_left_out":61}
{"sheet":"11","index":13,"n_rows":31,"n_cols":13,"rows_kept":31,"merged":[[0,5,0,6]]}
[{"$f":"VALUE(MID(CELL(\"filename\",A1),FIND(\"]\",CELL(\"filename\",A1))+1,LEN(CELL(\"filename\",A1))-FIND(\"]\",CELL(\"filename\",A1))+1))","v":11},"Finished",{"$nulls":3},"Navigator",null,null,"Solution"]
[{"$nulls":7},"a.)","We'll assume Group A is really 3 or more years accident free."]
["Points","The following data were compiled from ABC Insurance Company's portfolio of",{"$nulls":6},"First calculate the claim frequency for each group using the earned premium as the exposure base as this is the only option."]
[{"$f":"INDEX('Point Grid'!B:B,MATCH('11'!A1,'Point Grid'!A:A,0))","v":3.5},"Private Passenger Auto policies.",{"$nulls":6},"Then calculate the relative claim frequency for each group to the total claim frequency and set the experience modification "]
[{"$nulls":8},"equal to the relative claim frequency"]
[null,"Group","Number of accident ","Earned Premium at ","Number of"]
{"$rows_left_out":26}
{"sheet":"12","index":14,"n_rows":33,"n_cols":13,"rows_kept":33,"merged":[[0,4,0,5]]}
[{"$f":"VALUE(MID(CELL(\"filename\",A1),FIND(\"]\",CELL(\"filename\",A1))+1,LEN(CELL(\"filename\",A1))-FIND(\"]\",CELL(\"filename\",A1))+1))","v":12},"Finished",null,null,"Navigator",null,null,"Solution"]
[{"$nulls":6},"a.)","Balance Equations"]
["Points","Consider two policies:",{"$nulls":8},"and "]
[{"$f":"INDEX('Point Grid'!B:B,MATCH('12'!A1,'Point Grid'!A:A,0))","v":2},"   • A retrospectively rated policy with no loss limit,"]
[null,"   • A retrospectively rated policy with a $500,000 loss limit."]
[{"$nulls":7},"When there is a loss limitation, replace the denominators with "]
{"$rows_left_out":28}
{"sheet":"13","index":15,"n_rows":68,"n_cols":13,"rows_kept":68,"merged":[[0,4,0,5]]}
[{"$f":"VALUE(MID(CELL(\"filename\",A1),FIND(\"]\",CELL(\"filename\",A1))+1,LEN(CELL(\"filename\",A1))-FIND(\"]\",CELL(\"filename\",A1))+1))","v":13},"Finished",null,null,"Navigator",null,null,"Solution"]
[{"$nulls":6},"a.)","E[A] =",{"$f":"AVERAGE(C7:C21)","v":{"v":0.6093333333333334,"d":"60.9%"}},"We can use a straight average since we're told all risks are approximately equal in size."]
["Points","The unlimited and limited loss ratios for 15 risks of ",{"$nulls":5},"E[A_D] =",{"$f":"AVERAGE(D7:D21)","v":{"v":0.5186666666666667,"d":"51.9%"}}]
[{"$f":"INDEX('Point Grid'!B:B,MATCH('13'!A1,'Point Grid'!A:A,0))","v":4},"approximately equal size are as follows:"]
[null,null,"Loss Ratio"]
[null,"Risk Number","Unlimited","Limited"]
{"$rows_left_out":63}
{"sheet":"14","index":16,"n_rows":28,"n_cols":15,"rows_kept":28,"merged":[[0,7,0,8]]}
[{"$f":"VALUE(MID(CELL(\"filename\",A1),FIND(\"]\",CELL(\"filename\",A1))+1,LEN(CELL(\"filename\",A1))-FIND(\"]\",CELL(\"filename\",A1))+1))","v":14},"Finished",{"$nulls":5},"Navigator",null,null,"Solution"]
[{"$nulls":9},"a.)","Calculate the deductible layer losses, given a claim occurred"]
["Points","Given the following information:",{"$nulls":8},"% of Claims","Deductible"]
[{"$f":"INDEX('Point Grid'!B:B,MATCH('14'!A1,'Point Grid'!A:A,0))","v":3.25},null,null,"Ground-up",{"$nulls":6},{"$f":"C6","v":{"v":0.45,"d":"45%"}},{"$f":"MIN(D6,$B$21)","v":{"v":22000,"d":"22,000"}}]
[null,null,"Percent of Claims","Loss per Claim",{"$nulls":6},{"$f":"C7","v":{"v":0.2,"d":"20%"}},{"$f":"MIN(D7,$B$21)","v":{"v":35000,"d":"35,000"}}]
[null,null,{"v":0.45,"d":"45%"},{"v":22000,"d":"22,000"},{"$nulls":6},{"$f":"C8","v":{"v":0.15,"d":"15%"}},{"$f":"MIN(D8,$B$21)","v":{"v":100000,"d":"100,000"}}]
{"$rows_left_out":23}
{"sheet":"15","index":17,"n_rows":39,"n_cols":12,"rows_kept":39,"merged":[[0,5,0,6]]}
[{"$f":"VALUE(MID(CELL(\"filename\",A1),FIND(\"]\",CELL(\"filename\",A1))+1,LEN(CELL(\"filename\",A1))-FIND(\"]\",CELL(\"filename\",A1))+1))","v":15},"Finished",{"$nulls":3},"Navigator",null,null,"Solution"]
[{"$nulls":7},"a.)","(i): H + I"]
["Points","The diagram below exhibits cumulative distribution functions:",{"$nulls":6},"(ii): B + E + H + I"]
[{"$f":"INDEX('Point Grid'!B:B,MATCH('15'!A1,'Point Grid'!A:A,0))","v":2},"   • F(y) represents aggregate loss ratios with no loss limit, and",{"$nulls":6},"(iii): A + B"]
[null,"   • F*(y) represents aggregate loss ratios adjusted for a per-occurrence loss limit.",{"$nulls":6},"(iv): (B + E + H) / (B + C + E + F + H + I) = B + E + H"]
[{"$nulls":8},"Alice: \"You should remember the area under F equals 1 so the denominator is 1.\""]
{"$rows_left_out":20}
{"sheet":"16","index":18,"n_rows":19,"n_cols":13,"rows_kept":19,"merged":[[0,5,0,6]]}
[{"$f":"VALUE(MID(CELL(\"filename\",A1),FIND(\"]\",CELL(\"filename\",A1))+1,LEN(CELL(\"filename\",A1))-FIND(\"]\",CELL(\"filename\",A1))+1))","v":16},"Finished",{"$nulls":3},"Navigator",null,null,"Solution"]
[{"$nulls":7},"a.)","We need the capped pure premium distributions and then to calculate the variance and standard deviation."]
["Points","You believe the standard deviation of pure premiums is an appropriate measure of risk."]
[{"$f":"INDEX('Point Grid'!B:B,MATCH('16'!A1,'Point Grid'!A:A,0))","v":2},"You are given the following pure premium distribution:",{"$nulls":6},"Cap at $2,000",null,null,"Cap at $5,000"]
[{"$nulls":8},"Capped Amount","Probability",null,"Capped Amount","Probability"]
[null,"Loss Amount","Probability",{"$nulls":5},{"$f":"MIN(B7,$B$12)","v":{"v":0,"d":"$0"}},{"$f":"C7","v":{"v":0.9,"d":"90%"}},null,{"$f":"MIN(B7,$B$13)","v":{"v":0,"d":"$0"}},{"$f":"C7","v":{"v":0.9,"d":"90%"}}]
{"$rows_left_out":14}
{"sheet":"17","index":19,"n_rows":33,"n_cols":13,"rows_kept":33,"merged":[[0,4,0,5]]}
[{"$f":"VALUE(MID(CELL(\"filename\",A1),FIND(\"]\",CELL(\"filename\",A1))+1,LEN(CELL(\"filename\",A1))-FIND(\"]\",CELL(\"filename\",A1))+1))","v":17},"Finished",null,null,"Navigator",null,null,"Solution"]
[{"$nulls":6},"a.)","Initial Loss in Layer",null,null,"Trend claims by one year"]
["Points","An insurance company purchases Workers' Compensation excess of loss ",{"$nulls":5},"Loss Number","Loss in Layer",null,"Loss Number","Trended Loss","Loss in Layer"]
[{"$f":"INDEX('Point Grid'!B:B,MATCH(VALUE('17'!A1),'Point Grid'!A:A,0))","v":1},"coverage of $500,000 per claim. Losses in the current year are as follows:",{"$nulls":5},{"$f":"B7","v":1},{"$f":"MIN($B$14,MAX(0,C7-$B$13))","v":0},null,{"$f":"B7","v":1},{"$f":"C7*(1+$B$15)","v":{"v":545000,"d":"545,000"}},{"$f":"MIN($B$14,MAX(0,L4-$B$13))","v":{"v":45000,"d":"45,000"}}]
[{"$nulls":7},{"$f":"B8","v":2},{"$f":"MIN($B$14,MAX(0,C8-$B$13))","v":{"v":100000,"d":"100,000"}},null,{"$f":"B8","v":2},{"$f":"C8*(1+$B$15)","v":{"v":654000,"d":"654,000"}},{"$f":"MIN($B$14,MAX(0,L5-$B$13))","v":{"v":154000,"d":"154,000"}}]
[null,"Loss Number","Incurred Loss",{"$nulls":4},{"$f":"B9","v":3},{"$f":"MIN($B$14,MAX(0,C9-$B$13))","v":0},null,{"$f":"B9","v":3},{"$f":"C9*(1+$B$15)","v":{"v":381500,"d":"381,500"}},{"$f":"MIN($B$14,MAX(0,L6-$B$13))","v":0}]
{"$rows_left_out":28}
{"sheet":"18","index":20,"n_rows":28,"n_cols":16,"rows_kept":28,"merged":[[0,6,0,7]]}
[{"$f":"VALUE(MID(CELL(\"filename\",A1),FIND(\"]\",CELL(\"filename\",A1))+1,LEN(CELL(\"filename\",A1))-FIND(\"]\",CELL(\"filename\",A1))+1))","v":18},"Finished",{"$nulls":4},"Navigator",null,null,"Solution"]
[{"$nulls":8},"a.)","For a uniform distribution on [0, b] we have:"]
["Points","Per-claim accident severity is modeled using a uniform distribution on the"]
[{"$f":"INDEX('Point Grid'!B:B,MATCH('18'!A1,'Point Grid'!A:A,0))","v":3.25},"interval [0, 18,000]."]
[{"$nulls":9},{"$f":"AVERAGE(0,18000)","v":{"v":9000,"d":"9,000"}},"Expected Severity"]
["(a)","Using the equally spaced evaluation points of $3,000 calculate the probability density "]
{"$rows_left_out":23}
{"sheet":"19","index":21,"n_rows":36,"n_cols":14,"rows_kept":36,"merged":[[0,7,0,8]]}
[{"$f":"VALUE(MID(CELL(\"filename\",A1),FIND(\"]\",CELL(\"filename\",A1))+1,LEN(CELL(\"filename\",A1))-FIND(\"]\",CELL(\"filename\",A1))+1))","v":19},"Finished",{"$nulls":5},"Navigator",null,null,"Solution"]
[{"$nulls":9},"a.)","This diminishing deductible eliminates all losses below $500 and eliminates proportionally less until the ground-up"]
["Points","An actuary is pricing a diminishing deductible which starts at $500 and ends ",{"$nulls":8},"claim size reaches $1,500 at which point the deductible does not eliminate any loss."]
[{"$f":"INDEX('Point Grid'!B:B,MATCH('19'!A1,'Point Grid'!A:A,0))","v":2.5},"at $1,500 using the following ground-up claims data:",{"$nulls":9},"Size of Deductible"]
[{"$nulls":10},"Claim","Diminishing","Franchise","Straight"]
[null,null,"Claim #","Loss Size",null,"Claim #","Loss Size",{"$nulls":3},1,{"$f":"IF(D7<500,D7,IF(D7>1500,0,500/(1500-500)*(1500-D7)))","v":325},{"$f":"IF(D7<=1500,D7,0)","v":850},{"$f":"MIN(D7,500)","v":500}]
{"$rows_left_out":31}
{"sheet":"20","index":22,"n_rows":44,"n_cols":16,"rows_kept":44}
[{"$f":"VALUE(MID(CELL(\"filename\",A1),FIND(\"]\",CELL(\"filename\",A1))+1,LEN(CELL(\"filename\",A1))-FIND(\"]\",CELL(\"filename\",A1))+1))","v":20},"Finished",{"$nulls":5},"Navigator",null,"Solution"]
[{"$nulls":8},"a.)","For a Pareto distribution we have: "]
["Points","An actuary is estimating the impact of inflation on their book of business."]
[{"$f":"INDEX('Point Grid'!B:B,MATCH(A1,'Point Grid'!A:A,0))","v":2.75},{"$nulls":8},"E[X; 9,000] =",null,{"$f":"C7/(C6-1)*(1-(C7/(9000+C7))^(C6-1))","v":{"v":2250,"d":"2,250"}}]
[null,"They model claim-size using a Pareto distribution with parameters:",{"$nulls":7},"E[X; 5,000] =",null,{"$f":"C7/(C6-1)*(1-(C7/(5000+C7))^(C6-1))","v":{"v":1875,"d":"1,875"}}]
[null,"α =",2]
{"$rows_left_out":39}
{"sheet":"21","index":23,"n_rows":46,"n_cols":10,"rows_kept":46}
[{"$f":"VALUE(MID(CELL(\"filename\",A1),FIND(\"]\",CELL(\"filename\",A1))+1,LEN(CELL(\"filename\",A1))-FIND(\"]\",CELL(\"filename\",A1))+1))","v":21},"Finished",{"$nulls":5},"Navigator",null,"Solution"]
[{"$nulls":8},"a.)","Categories A and D are assigned partial credibility because they deviate away from the GLM relativity towards their complement."]
["Points","An actuary has built a GLM and a lasso credibility model and is evaluating the",{"$nulls":7},"Category B is assigned full credibility because even though the complement and lasso credibility relativities are the same, this category has a lot of exposures."]
[{"$f":"INDEX('Point Grid'!B:B,MATCH(A1,'Point Grid'!A:A,0))","v":4},"model output for a categorical variable with five levels.",{"$nulls":7},"Category C is assigned zero credibility because the lasso credibility relativity is the same as the complement relativity and the exposure volume is low."]
[{"$nulls":9},"Category E is assigned full credibility because the GLM relativity and lasso credibility are the same and there are ample exposures."]
[null,"The complement of credibility for the lasso credibility model is the current"]
{"$rows_left_out":30}