{"text_format":"3","workbook":"xlsx","n_sheets":24,"sheets":["Instructions","Point Grid","Navigator","1","2","3","4","5","6","7","8","9","10","11","12","13","14","15","16","17","18","19","20","21"],"not_rendered":{"charts":1,"images":2},"read":"whole","date_system":"1900"}

{"sheet":"Instructions","index":0,"n_rows":32,"n_cols":1,"rows_kept":32}
[]
[]
[]
[]
[]
["Instructions"]
[]
["1.) Find a quiet place and allow yourself the full four hour exam period to practice. Treat this just as you would the real exam."]
[]
["2.) Use the Navigator worksheet to see a brief description of each question, its point value and navigate between questions in your preferred order."]
{"$rows_left_out":23}
{"sheet":"Point Grid","index":1,"n_rows":32,"n_cols":19,"rows_kept":32,"merged":[[5,1,6,1]]}
[]
[]
[]
[]
["Practice Exam 2 – Exam 8"]
[null,"Total Point Value","Sub-Part of Question",{"$nulls":8},"Your Score","Sub-Part of Question"]
["Question",null,"(a)","(b)","(c)","(d)","(e)","(f)","(g)","Status",null,"Question","(a)","(b)","(c)","(d)","(e)","(f)","(g)"]
[1,{"$f":"SUM(C8:I8)","v":5.75},{"v":2.5,"d":"2.50"},{"v":2,"d":"2.00"},{"v":0.5,"d":"0.50"},0.75,{"$nulls":3},{"$f":"INDIRECT(\"'\"&A8&\"'!B1\")","v":"Incomplete"},null,{"$f":"A8","v":1},{"$f":"_xlfn.IFNA(IF(ISBLANK(INDEX(INDIRECT(\"'\"&$L8&\"'!$A:$A\"),MATCH(M$7,INDIRECT(\"'\"&$L8&\"'!$A:$A\"),0)+2)),\"\",INDEX(INDIRECT(\"'\"&$L8&\"'!$A:$A\"),MATCH(M$7,INDIRECT(\"'\"&$L8&\"'!$A:$A\"),0)+2)),\"\")","v":""},"","","","","",""]
[2,{"$f":"SUM(C9:I9)","v":2.75},{"v":1,"d":"1.00"},{"v":1,"d":"1.00"},0.75,{"$nulls":4},{"$f":"INDIRECT(\"'\"&A9&\"'!B1\")","v":"Incomplete"},null,{"$f":"A9","v":2},"","","","","","",""]
[3,{"v":2.5,"d":"2.50"},{"v":2,"d":"2.00"},{"v":0.5,"d":"0.50"},{"$nulls":5},"Incomplete",null,3,"","","","","","",""]
{"$rows_left_out":23}
{"sheet":"Navigator","index":2,"n_rows":29,"n_cols":8,"rows_kept":29,"merged":[[8,0,8,6],[9,0,9,6],[10,0,10,6],[11,0,11,6],[12,0,12,6],[13,0,13,6],[14,0,14,6],[15,0,15,6],[16,0,16,6],[17,0,17,6],[18,0,18,6],[19,0,19,6],[20,0,20,6],[21,0,21,6],[22,0,22,6],[23,0,23,6],[24,0,24,6],[25,0,25,6],[26,0,26,6],[27,0,27,6],[28,0,28,6]]}
[]
[]
[]
[]
[]
["Navigator – Select a question to go to it"]
[]
["Question #",{"$nulls":6},"Status"]
["Q1 -- Mahler -- Shifting Risk Parameters -- 5.75 points",{"$nulls":6},{"$f":"'Point Grid'!J8","v":"Incomplete"}]
["Q2 -- Goldburd (GLM) -- GLM offsets -- 2.75 points",{"$nulls":6},{"$f":"'Point Grid'!J9","v":"Incomplete"}]
{"$rows_left_out":20}
{"sheet":"1","index":3,"n_rows":55,"n_cols":10,"rows_kept":55,"merged":[[0,6,0,7]]}
[{"$f":"VALUE(MID(CELL(\"filename\",A1),FIND(\"]\",CELL(\"filename\",A1))+1,LEN(CELL(\"filename\",A1))-FIND(\"]\",CELL(\"filename\",A1))+1))","v":1},"Incomplete",{"$nulls":4},"Navigator",null,null,"Solution"]
[{"$nulls":8},"a.)"]
["Points","A State Regulator is reviewing a Homeowners rate filing made by XYZ Insuance Company (XYZ)."]
[{"$f":"INDEX('Point Grid'!B:B,MATCH('1'!A1,'Point Grid'!A:A,0))","v":5.75},"XYZ provided 15 years of historical data as of 12/31/2022 in support of their catastrophe provision:"]
[]
[null,"Accident","Earned","Case Incurred Loss and DCC ($000)"]
[null,"Year","Exposures","Catastrophic","Non-Catastrophic"]
[null,2007,{"v":2601,"d":"2,601"},0,{"v":14100,"d":"14,100"}]
[null,2008,{"v":7331,"d":"7,331"},0,{"v":25700,"d":"25,700"}]
[null,2009,{"v":14330,"d":"14,330"},{"v":10024,"d":"10,024"},{"v":30000,"d":"30,000"}]
{"$rows_left_out":46}
{"sheet":"2","index":4,"n_rows":34,"n_cols":10,"rows_kept":34,"merged":[[0,6,0,7]]}
[{"$f":"VALUE(MID(CELL(\"filename\",A1),FIND(\"]\",CELL(\"filename\",A1))+1,LEN(CELL(\"filename\",A1))-FIND(\"]\",CELL(\"filename\",A1))+1))","v":2},"Incomplete",{"$nulls":4},"Navigator",null,null,"Solution"]
[{"$nulls":8},"a.)"]
["Points","An analyst is building a generalized linear model for a rating plan. The new plan"]
[{"$f":"INDEX('Point Grid'!B:B,MATCH('2'!A1,'Point Grid'!A:A,0))","v":2.75},"will include the territory and deductible relativities from their existing  rating plan."]
[]
["(a)","Briefly describe how the analyst should incorporate territory and deductible into"]
[{"$f":"INDEX('Point Grid'!$C$8:$I$27,MATCH($A$1,'Point Grid'!$A$8:$A$27,0),MATCH(A6,'Point Grid'!$C$7:$I$7,0))","v":1},"the GLM and explain why they should do this for each."]
[]
[]
["(b)","The analyst is building a pure premium model using a log-link function."]
{"$rows_left_out":25}
{"sheet":"3","index":5,"n_rows":17,"n_cols":11,"rows_kept":17,"merged":[[0,7,0,8]]}
[{"$f":"VALUE(MID(CELL(\"filename\",A1),FIND(\"]\",CELL(\"filename\",A1))+1,LEN(CELL(\"filename\",A1))-FIND(\"]\",CELL(\"filename\",A1))+1))","v":3},"Incomplete",{"$nulls":5},"Navigator",null,null,"Solution"]
[{"$nulls":9},"a.)"]
["Points","You are given the following table for model selection:"]
[{"$f":"INDEX('Point Grid'!B:B,MATCH('3'!A1,'Point Grid'!A:A,0))","v":2.5}]
[{"$nulls":6},"Number of"]
[null,"Model",{"$nulls":3},"-2*ll","Parameters","AIC"]
[null,"Intercept + Age",{"$nulls":3},"A",5,435]
[null,"Intercept + Vehicle Body",{"$nulls":3},392,11,414]
[null,"Intercept + Age + Vehicle Value",{"$nulls":3},392,"X",446]
[null,"Intercept + Age + Vehicle Body + Vehicle Value",{"$nulls":3},"B","Y",501]
{"$rows_left_out":8}
{"sheet":"4","index":6,"n_rows":36,"n_cols":10,"rows_kept":36,"merged":[[0,6,0,7]]}
[{"$f":"VALUE(MID(CELL(\"filename\",A1),FIND(\"]\",CELL(\"filename\",A1))+1,LEN(CELL(\"filename\",A1))-FIND(\"]\",CELL(\"filename\",A1))+1))","v":4},"Incomplete",{"$nulls":4},"Navigator",null,null,"Solution"]
[{"$nulls":8},"a.)"]
["Points","You are given the following information for a fitted GLM:"]
[{"$f":"INDEX('Point Grid'!B:B,MATCH('4'!A1,'Point Grid'!A:A,0))","v":2}]
[null,"Response variable","Occurrence of Accidents"]
[null,"Response distribution","Binomial"]
[null,"Link","Logit"]
[]
[null,null,"Degrees of"]
[null,"Parameter"," Freedom"]
{"$rows_left_out":27}
{"sheet":"5","index":7,"n_rows":43,"n_cols":9,"rows_kept":43,"merged":[[0,5,0,6]]}
[{"$f":"VALUE(MID(CELL(\"filename\",A1),FIND(\"]\",CELL(\"filename\",A1))+1,LEN(CELL(\"filename\",A1))-FIND(\"]\",CELL(\"filename\",A1))+1))","v":5},"Incomplete",{"$nulls":3},"Navigator",null,null,"Solution"]
[{"$nulls":7},"a.)"]
["Points","An actuary is working on a usage based insurance (UBI) program for a state's Private Passenger"]
[{"$f":"INDEX('Point Grid'!B:B,MATCH('5'!A1,'Point Grid'!A:A,0))","v":4.25},"Automobile market. They create a generalized linear model (GLM) to predict claim severity"]
[null,"by Daily Miles Driven (DMD), Vehicle Type, and Electric Vehicle Ind (EVInd)."]
[]
[null,"• Policies are effective for 6-months and the actuary uses data from 2017 through 2019."]
[null,"• Daily Miles Driven is a continuous variable with a base level of 20 miles per day."]
[null,"• Vehicle Type is a categorical variable with levels: Car, Truck, and Van."]
[null,"• Electric Vehicle Ind is a binary variable which classifies whether a vehicle is counted as"]
{"$rows_left_out":34}
{"sheet":"6","index":8,"n_rows":43,"n_cols":15,"rows_kept":43,"merged":[[0,11,0,12]]}
[{"$f":"VALUE(MID(CELL(\"filename\",A1),FIND(\"]\",CELL(\"filename\",A1))+1,LEN(CELL(\"filename\",A1))-FIND(\"]\",CELL(\"filename\",A1))+1))","v":6},"Incomplete",{"$nulls":9},"Navigator",null,null,"Solution"]
[{"$nulls":13},"a.)"]
["Points","An actuary has collected the following claim count data for Workers' Compensation claims."]
[{"$f":"INDEX('Point Grid'!B:B,MATCH('6'!A1,'Point Grid'!A:A,0))","v":4.75},"The only injury types are Fatal, Major, and Temporary Total (TT)."]
[null,"The classes below are the only classes the company writes in Hazard Group F."]
[]
[null,null,"Year 1",null,null,"Year 2",null,null,"Total"]
[null,"Class","Fatal","Major","TT","Fatal","Major","TT","Fatal","Major","TT"]
[null,1,1,13,415,8,27,168,{"$f":"C9+F9","v":9},{"$f":"D9+G9","v":40},583]
[null,2,6,18,245,9,15,205,{"$f":"C10+F10","v":15},{"$f":"D10+G10","v":33},{"$f":"E10+H10","v":450}]
{"$rows_left_out":34}
{"sheet":"7","index":9,"n_rows":48,"n_cols":14,"rows_kept":48,"merged":[[0,10,0,11],[42,2,43,2],[44,2,45,2],[46,2,47,2]]}
[{"$f":"VALUE(MID(CELL(\"filename\",A1),FIND(\"]\",CELL(\"filename\",A1))+1,LEN(CELL(\"filename\",A1))-FIND(\"]\",CELL(\"filename\",A1))+1))","v":7},"Incomplete",{"$nulls":8},"Navigator",null,null,"Solution"]
[{"$nulls":12},"a.)"]
["Points","The following policy is being rated using the ISO CGL rating plan."]
[{"$f":"INDEX('Point Grid'!B:B,MATCH(A1,'Point Grid'!A:A,0))","v":2.75},{"$nulls":5},"Current Company Rates per Exposure"]
[null,{"$f":"DATE(YEAR(TODAY()),12,1)","v":"2025-12-01"},"Effective Date",{"$nulls":3},"Policy Type","Sub-line","Rate"]
[null,"Claims-Made (CM)","Policy Type",{"$nulls":3},"3rd-yr CM","Prem/Ops",7.7]
[null,{"v":0.72,"d":"72%"},"Expected Loss Ratio (ELR)",{"$nulls":3},"3rd-yr CM","Products",8.9]
[{"$nulls":6},"2nd-yr CM","Prem/Ops",3.3]
[{"$nulls":6},"2nd-yr CM","Products",4.2]
[{"$nulls":6},"1st-yr CM","Prem/Ops",1.8]
{"$rows_left_out":39}
{"sheet":"8","index":10,"n_rows":24,"n_cols":9,"rows_kept":24,"merged":[[0,5,0,6]]}
[{"$f":"VALUE(MID(CELL(\"filename\",A1),FIND(\"]\",CELL(\"filename\",A1))+1,LEN(CELL(\"filename\",A1))-FIND(\"]\",CELL(\"filename\",A1))+1))","v":8},"Incomplete",{"$nulls":3},"Navigator",null,null,"Solution"]
[{"$nulls":7},"a.)"]
["Points","The following information was taken from two different experience rating plans:"]
[{"$f":"INDEX('Point Grid'!B:B,MATCH('8'!A1,'Point Grid'!A:A,0))","v":3.5},null,"Experience Mod",null,"Experience Data"]
[null,"Insured","Plan A","Plan B","Manual Premium ($)","Losses ($)"]
[null,1,0.62,0.66,{"v":100000,"d":"100,000"},{"v":65000,"d":"65,000"}]
[null,2,0.77,0.81,{"v":80000,"d":"80,000"},{"v":80000,"d":"80,000"}]
[null,3,0.92,0.96,{"v":100000,"d":"100,000"},{"v":95000,"d":"95,000"}]
[null,4,0.96,0.96,{"v":80000,"d":"80,000"},{"v":96000,"d":"96,000"}]
[null,5,{"v":1,"d":"1.00"},0.97,{"v":100000,"d":"100,000"},{"v":97000,"d":"97,000"}]
{"$rows_left_out":15}
{"sheet":"9","index":11,"n_rows":29,"n_cols":9,"rows_kept":29,"merged":[[0,5,0,6]]}
[{"$f":"VALUE(MID(CELL(\"filename\",A1),FIND(\"]\",CELL(\"filename\",A1))+1,LEN(CELL(\"filename\",A1))-FIND(\"]\",CELL(\"filename\",A1))+1))","v":9},"Incomplete",{"$nulls":3},"Navigator",null,null,"Solution"]
[{"$nulls":7},"a.)"]
["Points"]
[{"$f":"INDEX('Point Grid'!B:B,MATCH('9'!A1,'Point Grid'!A:A,0))","v":3.5}]
[]
["(a)","Identify and explain two goals of experience rating."]
[{"$f":"INDEX('Point Grid'!$C$8:$I$27,MATCH($A$1,'Point Grid'!$A$8:$A$27,0),MATCH(A6,'Point Grid'!$C$7:$I$7,0))","v":1}]
[]
[]
["(b)","Given the following Workers' Compensation information for a Construction company:"]
{"$rows_left_out":20}
{"sheet":"10","index":12,"n_rows":66,"n_cols":10,"rows_kept":66,"merged":[[0,6,0,7]]}
[{"$f":"VALUE(MID(CELL(\"filename\",A1),FIND(\"]\",CELL(\"filename\",A1))+1,LEN(CELL(\"filename\",A1))-FIND(\"]\",CELL(\"filename\",A1))+1))","v":10},"Incomplete",{"$nulls":4},"Navigator",null,null,"Solution"]
[{"$nulls":8},"a.)"]
["Points","Both Employer A and Employer B want to purchase Workers' Compensation insurance in Alabama."]
[{"$f":"INDEX('Point Grid'!B:B,MATCH('10'!A1,'Point Grid'!A:A,0))","v":5.5},"The effective date is January 1, 2023 for each policy. The following information applies:"]
[]
[null,"Policy Effective Date","Months of Data","Subject Premium"]
[{"$nulls":3},"Employer A","Employer B"]
[null,"2022-01-01",12,{"v":4500,"d":"4,500"},{"v":3000,"d":"3,000"}]
[null,"2021-01-01",12,{"v":6000,"d":"6,000"},{"v":5000,"d":"5,000"}]
[null,"2020-01-01",12,{"v":5500,"d":"5,500"},{"v":5000,"d":"5,000"}]
{"$rows_left_out":57}
{"sheet":"11","index":13,"n_rows":29,"n_cols":9,"rows_kept":29,"merged":[[0,5,0,6]]}
[{"$f":"VALUE(MID(CELL(\"filename\",A1),FIND(\"]\",CELL(\"filename\",A1))+1,LEN(CELL(\"filename\",A1))-FIND(\"]\",CELL(\"filename\",A1))+1))","v":11},"Incomplete",{"$nulls":3},"Navigator",null,null,"Solution"]
[{"$nulls":7},"a.)"]
["Points","The following data were compiled from ABC Insurance Company's portfolio of"]
[{"$f":"INDEX('Point Grid'!B:B,MATCH('11'!A1,'Point Grid'!A:A,0))","v":3.5},"Private Passenger Auto policies."]
[]
[null,"Group","Number of accident ","Earned Premium at ","Number of"]
[null,null,"free years","Present Group D","Claims "]
[{"$nulls":3},"Rates","Incurred"]
[null,"A",3,{"v":100000000,"d":"100,000,000"},{"v":120000,"d":"120,000"}]
[null,"B",2,{"v":10000000,"d":"10,000,000"},{"v":25000,"d":"25,000"}]
{"$rows_left_out":20}
{"sheet":"12","index":14,"n_rows":18,"n_cols":8,"rows_kept":18,"merged":[[0,4,0,5]]}
[{"$f":"VALUE(MID(CELL(\"filename\",A1),FIND(\"]\",CELL(\"filename\",A1))+1,LEN(CELL(\"filename\",A1))-FIND(\"]\",CELL(\"filename\",A1))+1))","v":12},"Incomplete",null,null,"Navigator",null,null,"Solution"]
[{"$nulls":6},"a.)"]
["Points","Consider two policies:"]
[{"$f":"INDEX('Point Grid'!B:B,MATCH('12'!A1,'Point Grid'!A:A,0))","v":2},"   • A retrospectively rated policy with no loss limit,"]
[null,"   • A retrospectively rated policy with a $500,000 loss limit."]
[]
[null,"Both policies are subject to the following parameters:"]
[]
[null,{"v":1,"d":"1.00"},"Maximum Premium Factor"]
[null,{"v":0.4,"d":"0.40"},"Minimum Premium Factor"]
{"$rows_left_out":9}
{"sheet":"13","index":15,"n_rows":32,"n_cols":8,"rows_kept":32,"merged":[[0,4,0,5]]}
[{"$f":"VALUE(MID(CELL(\"filename\",A1),FIND(\"]\",CELL(\"filename\",A1))+1,LEN(CELL(\"filename\",A1))-FIND(\"]\",CELL(\"filename\",A1))+1))","v":13},"Incomplete",null,null,"Navigator",null,null,"Solution"]
[{"$nulls":6},"a.)"]
["Points","The unlimited and limited loss ratios for 15 risks of "]
[{"$f":"INDEX('Point Grid'!B:B,MATCH('13'!A1,'Point Grid'!A:A,0))","v":4},"approximately equal size are as follows:"]
[null,null,"Loss Ratio"]
[null,"Risk Number","Unlimited","Limited"]
[null,3,{"v":0.29,"d":"29%"},{"v":0.06,"d":"6%"}]
[null,4,{"v":0.35,"d":"35%"},{"v":0.06,"d":"6%"}]
[null,1,{"v":0.14,"d":"14%"},{"v":0.14,"d":"14%"}]
[null,2,{"v":0.25,"d":"25%"},{"v":0.25,"d":"25%"}]
{"$rows_left_out":23}
{"sheet":"14","index":16,"n_rows":24,"n_cols":11,"rows_kept":24,"merged":[[0,7,0,8]]}
[{"$f":"VALUE(MID(CELL(\"filename\",A1),FIND(\"]\",CELL(\"filename\",A1))+1,LEN(CELL(\"filename\",A1))-FIND(\"]\",CELL(\"filename\",A1))+1))","v":14},"Incomplete",{"$nulls":5},"Navigator",null,null,"Solution"]
[{"$nulls":9},"a.)"]
["Points","Given the following information:"]
[{"$f":"INDEX('Point Grid'!B:B,MATCH('14'!A1,'Point Grid'!A:A,0))","v":3.25},null,null,"Ground-up"]
[null,null,"Percent of Claims","Loss per Claim"]
[null,null,{"v":0.45,"d":"45%"},{"v":22000,"d":"22,000"}]
[null,null,{"v":0.2,"d":"20%"},{"v":35000,"d":"35,000"}]
[null,null,{"v":0.15,"d":"15%"},{"v":150000,"d":"150,000"}]
[null,null,{"v":0.15,"d":"15%"},{"v":250000,"d":"250,000"}]
[null,null,{"v":0.05,"d":"5%"},{"v":1000000,"d":"1,000,000"}]
{"$rows_left_out":15}
{"sheet":"15","index":17,"n_rows":39,"n_cols":9,"rows_kept":39,"merged":[[0,5,0,6]]}
[{"$f":"VALUE(MID(CELL(\"filename\",A1),FIND(\"]\",CELL(\"filename\",A1))+1,LEN(CELL(\"filename\",A1))-FIND(\"]\",CELL(\"filename\",A1))+1))","v":15},"Incomplete",{"$nulls":3},"Navigator",null,null,"Solution"]
[{"$nulls":7},"a.)"]
["Points","The diagram below exhibits cumulative distribution functions:"]
[{"$f":"INDEX('Point Grid'!B:B,MATCH('15'!A1,'Point Grid'!A:A,0))","v":2},"   • F(y) represents aggregate loss ratios with no loss limit, and"]
[null,"   • F*(y) represents aggregate loss ratios adjusted for a per-occurrence loss limit."]
[]
[null,"The diagram is also partitioned into nine areas labeled with the letters from A to I."]
{"$rows_empty":22}
["(a)","Using the labels provided, give an algebraic expression for each of the following quantities:"]
[{"$f":"INDEX('Point Grid'!$C$8:$I$27,MATCH($A$1,'Point Grid'!$A$8:$A$27,0),MATCH(A30,'Point Grid'!$C$7:$I$7,0))","v":1},"   (i) The Table M Charge at rG"]
{"$rows_left_out":9}
{"sheet":"16","index":18,"n_rows":18,"n_cols":9,"rows_kept":18,"merged":[[0,5,0,6]]}
[{"$f":"VALUE(MID(CELL(\"filename\",A1),FIND(\"]\",CELL(\"filename\",A1))+1,LEN(CELL(\"filename\",A1))-FIND(\"]\",CELL(\"filename\",A1))+1))","v":16},"Incomplete",{"$nulls":3},"Navigator",null,null,"Solution"]
[{"$nulls":7},"a.)"]
["Points","You believe the standard deviation of pure premiums is an appropriate measure of risk."]
[{"$f":"INDEX('Point Grid'!B:B,MATCH('16'!A1,'Point Grid'!A:A,0))","v":2},"You are given the following pure premium distribution:"]
[]
[null,"Loss Amount","Probability"]
[null,{"v":0,"d":"$0"},{"v":0.9,"d":"90%"}]
[null,{"v":1000,"d":"$1,000"},{"v":0.09,"d":"9%"}]
[null,{"v":10000,"d":"$10,000"},{"v":0.01,"d":"1%"}]
[]
{"$rows_left_out":9}
{"sheet":"17","index":19,"n_rows":18,"n_cols":8,"rows_kept":18,"merged":[[0,4,0,5]]}
[{"$f":"VALUE(MID(CELL(\"filename\",A1),FIND(\"]\",CELL(\"filename\",A1))+1,LEN(CELL(\"filename\",A1))-FIND(\"]\",CELL(\"filename\",A1))+1))","v":17},"Incomplete",null,null,"Navigator",null,null,"Solution"]
[{"$nulls":6},"a.)"]
["Points","An insurance company purchases Workers' Compensation excess of loss "]
[{"$f":"INDEX('Point Grid'!B:B,MATCH(VALUE('17'!A1),'Point Grid'!A:A,0))","v":1},"coverage of $500,000 per claim. Losses in the current year are as follows:"]
[]
[null,"Loss Number","Incurred Loss"]
[null,1,{"v":500000,"d":"500,000"}]
[null,2,{"v":600000,"d":"600,000"}]
[null,3,{"v":350000,"d":"350,000"}]
[null,4,{"v":1500000,"d":"1,500,000"}]
{"$rows_left_out":9}
{"sheet":"18","index":20,"n_rows":27,"n_cols":10,"rows_kept":27,"merged":[[0,6,0,7]]}
[{"$f":"VALUE(MID(CELL(\"filename\",A1),FIND(\"]\",CELL(\"filename\",A1))+1,LEN(CELL(\"filename\",A1))-FIND(\"]\",CELL(\"filename\",A1))+1))","v":18},"Incomplete",{"$nulls":4},"Navigator",null,null,"Solution"]
[{"$nulls":8},"a.)"]
["Points","Per-claim accident severity is modeled using a uniform distribution on the"]
[{"$f":"INDEX('Point Grid'!B:B,MATCH('18'!A1,'Point Grid'!A:A,0))","v":3.25},"interval [0, 18,000]."]
[]
["(a)","Using the equally spaced evaluation points of $3,000 calculate the probability density "]
[{"$f":"INDEX('Point Grid'!$C$8:$I$27,MATCH($A$1,'Point Grid'!$A$8:$A$27,0),MATCH(A6,'Point Grid'!$C$7:$I$7,0))","v":2},"function for a discrete version of this distribution for use in Panjer's recursive"]
[null," algorithm."]
[]
[null,"A multi-state, multi-hazard group policy is being priced using the following information:"]
{"$rows_left_out":18}
{"sheet":"19","index":21,"n_rows":30,"n_cols":11,"rows_kept":30,"merged":[[0,7,0,8]]}
[{"$f":"VALUE(MID(CELL(\"filename\",A1),FIND(\"]\",CELL(\"filename\",A1))+1,LEN(CELL(\"filename\",A1))-FIND(\"]\",CELL(\"filename\",A1))+1))","v":19},"Incomplete",{"$nulls":5},"Navigator",null,null,"Solution"]
[{"$nulls":9},"a.)"]
["Points","An actuary is pricing a diminishing deductible which starts at $500 and ends "]
[{"$f":"INDEX('Point Grid'!B:B,MATCH('19'!A1,'Point Grid'!A:A,0))","v":2.5},"at $1,500 using the following ground-up claims data:"]
[]
[null,null,"Claim #","Loss Size",null,"Claim #","Loss Size"]
[null,null,1,850,null,9,400]
[null,null,2,{"v":2250,"d":"2,250"},null,10,{"v":5000,"d":"5,000"}]
[null,null,3,{"v":1250,"d":"1,250"},null,11,{"v":1500,"d":"1,500"}]
[null,null,4,{"v":1000,"d":"1,000"},null,12,{"v":2000,"d":"2,000"}]
{"$rows_left_out":21}
{"sheet":"20","index":22,"n_rows":26,"n_cols":10,"rows_kept":26}
[{"$f":"VALUE(MID(CELL(\"filename\",A1),FIND(\"]\",CELL(\"filename\",A1))+1,LEN(CELL(\"filename\",A1))-FIND(\"]\",CELL(\"filename\",A1))+1))","v":20},"Incomplete",{"$nulls":5},"Navigator",null,"Solution"]
[{"$nulls":8},"a.)"]
["Points","An actuary is estimating the impact of inflation on their book of business."]
[2.75]
[null,"They model claim-size using a Pareto distribution with parameters:"]
[null,"α =",2]
[null,"β =",{"v":3000,"d":"3,000"}]
[]
[null,"Estimated Inflation",{"v":0.1,"d":"10%"}]
[null,"Exposure Growth",{"v":0.05,"d":"5%"}]
{"$rows_left_out":17}
{"sheet":"21","index":23,"n_rows":45,"n_cols":10,"rows_kept":45}
[{"$f":"VALUE(MID(CELL(\"filename\",A1),FIND(\"]\",CELL(\"filename\",A1))+1,LEN(CELL(\"filename\",A1))-FIND(\"]\",CELL(\"filename\",A1))+1))","v":21},"Incomplete",{"$nulls":5},"Navigator",null,"Solution"]
[]
["Points","An actuary has built a GLM and a lasso credibility model and is evaluating the"]
[{"$f":"INDEX('Point Grid'!B:B,MATCH(A1,'Point Grid'!A:A,0))","v":4},"model output for a categorical variable with five levels."]
[]
[null,"The complement of credibility for the lasso credibility model is the current"]
[null,"rating plan relativities which were previously produced by a GLM."]
[]
["(a)","Using the table and graph below, briefly explain the broad level of credibility"]
[{"$f":"INDEX('Point Grid'!$C$8:$I$28,MATCH($A$1,'Point Grid'!$A$8:$A$28,0),MATCH(A9,'Point Grid'!$C$7:$I$7,0))","v":2.5},"assigned to each category by the lasso credibility model and explain"]
{"$rows_left_out":20}